 




﻿"Item Id","Item URI","Dublin Core:Title","Dublin Core:Subject","Dublin Core:Description","Dublin Core:Creator","Dublin Core:Source","Dublin Core:Publisher","Dublin Core:Date","Dublin Core:Contributor","Dublin Core:Rights","Dublin Core:Relation","Dublin Core:Format","Dublin Core:Language","Dublin Core:Type","Dublin Core:Identifier","Dublin Core:Coverage","Item Type Metadata:Text","Item Type Metadata:Interviewer","Item Type Metadata:Interviewee","Item Type Metadata:Location","Item Type Metadata:Transcription","Item Type Metadata:Local URL","Item Type Metadata:Original Format","Item Type Metadata:Physical Dimensions","Item Type Metadata:Duration","Item Type Metadata:Compression","Item Type Metadata:Producer","Item Type Metadata:Director","Item Type Metadata:Bit Rate/Frequency","Item Type Metadata:Time Summary","Item Type Metadata:Email Body","Item Type Metadata:Subject Line","Item Type Metadata:From","Item Type Metadata:To","Item Type Metadata:CC","Item Type Metadata:BCC","Item Type Metadata:Number of Attachments","Item Type Metadata:Standards","Item Type Metadata:Objectives","Item Type Metadata:Materials","Item Type Metadata:Lesson Plan Text","Item Type Metadata:URL","Item Type Metadata:Event Type","Item Type Metadata:Participants","Item Type Metadata:Birth Date","Item Type Metadata:Birthplace","Item Type Metadata:Death Date","Item Type Metadata:Occupation","Item Type Metadata:Biographical Text","Item Type Metadata:Bibliography","Item Type Metadata:Digital Reproduction Information","Item Type Metadata:Repository","Item Type Metadata:Repository Collection","Item Type Metadata:Contact information.","Item Type Metadata:File Name","Item Type Metadata:Notes","Item Type Metadata:Digital item created","Item Type Metadata:Digital item modified","Item Type Metadata:Executive Orders","Item Type Metadata:Record Created","Item Type Metadata:Record Modified","Item Type Metadata:Transcription2","Item Type Metadata:Source URL","Omeka Legacy File:Additional Creator","Omeka Legacy File:Transcriber","Omeka Legacy File:Producer","Omeka Legacy File:Render Device","Omeka Legacy File:Render Details","Omeka Legacy File:Capture Date","Omeka Legacy File:Capture Device","Omeka Legacy File:Capture Details","Omeka Legacy File:Change History","Omeka Legacy File:Watermark","Omeka Legacy File:Encryption","Omeka Legacy File:Compression","Omeka Legacy File:Post Processing","Omeka Image File:Width","Omeka Image File:Height","Omeka Image File:Bit Depth","Omeka Image File:Channels","Omeka Image File:Exif String","Omeka Image File:Exif Array","Omeka Image File:IPTC String","Omeka Image File:IPTC Array","Omeka Video File:Bitrate","Omeka Video File:Duration","Omeka Video File:Sample Rate","Omeka Video File:Codec","Omeka Video File:Width","Omeka Video File:Height",tags,file,itemType,collection,public,featured
64260,http://www.iowaheritage.org/items/show/64260,"We see alot of this at this time of year","Holidays|Houses|2000-2010|Christmas|Public safety|Firemen|Roofs|Wives|Husbands|Snow|Christmas lights",Fire,"Duffy, Brian, 1955-",,"University of Iowa. Libraries. Special Collections Dept.",2003-12-14|2011-04,,"Educational use only, no other permissions given. Copyright to this digital object is owned by The Des Moines Register; it may not be downloaded, reproduced, or distributed without written permission. For more information, contact the Special Collections Department.","Editorial Cartoons of Brian Duffy; Des Moines Register Cartoonists|Papers of Brian Duffy|Des Moines Register",,English,"Still image|Editorial cartoons",MSC916|duffy-031214|http://digital.lib.uiowa.edu/cdm/ref/collection/duffy/id/98,,,,,,,,,,,,,,,,,,,,,,,,,,,,,,,,,,,,,,,,,,,,,,,,"<a href=""http://digital.lib.uiowa.edu/cdm/ref/collection/duffy/id/98"" target=""_blank"">View this item in its source respository</a>",,,,,,,,,,,,,,,,,,,,,,,,,,,,,http://www.iowaheritage.org/files/original/0811fff9a63e091e5db552233bf2385c.jpg,"Remote Item","Editorial Cartoons of Brian Duffy",1,0
64261,http://www.iowaheritage.org/items/show/64261,"Soldier catching Saddam Hussein","War|Hussein, Saddam, 1937-2006|Iraq|Iraq War, 2003-|Deserts|2000-2010|Dictators|Dictatorships|Sun|Soldiers|Palm trees|Tunnels|Dictators|Hiding|Sheep",,"Duffy, Brian, 1955-",,"University of Iowa. Libraries. Special Collections Dept.",2003-12-15|2011-04,,"Educational use only, no other permissions given. Copyright to this digital object is owned by The Des Moines Register; it may not be downloaded, reproduced, or distributed without written permission. For more information, contact the Special Collections Department.","Editorial Cartoons of Brian Duffy; Des Moines Register Cartoonists|Papers of Brian Duffy|Des Moines Register",,English,"Still image|Editorial cartoons",MSC916|duffy-031215|http://digital.lib.uiowa.edu/cdm/ref/collection/duffy/id/99,,,,,,,,,,,,,,,,,,,,,,,,,,,,,,,,,,,,,,,,,,,,,,,,"<a href=""http://digital.lib.uiowa.edu/cdm/ref/collection/duffy/id/99"" target=""_blank"">View this item in its source respository</a>",,,,,,,,,,,,,,,,,,,,,,,,,,,,,http://www.iowaheritage.org/files/original/051f77ea37d1bd7204c4a1a8dd6a1c53.jpg,"Remote Item","Editorial Cartoons of Brian Duffy",1,0
64262,http://www.iowaheritage.org/items/show/64262,"How does a trial by a jury of your peers strike you?","Dictators|Bush, George W. (George Walker), 1946-|United States|Presidents|2000-2010|Dictatorships|Presidents|Trials|Trials and tribulations|Tribunals|Crimes|Crimes and punishment|Criminals|War|Wars|Hussein, Saddam, 1937-2006|Iraq|Dictators|People|Shadows|Fear",,"Duffy, Brian, 1955-",,"University of Iowa. Libraries. Special Collections Dept.",2003-12-16|2011-04,,"Educational use only, no other permissions given. Copyright to this digital object is owned by The Des Moines Register; it may not be downloaded, reproduced, or distributed without written permission. For more information, contact the Special Collections Department.","Editorial Cartoons of Brian Duffy; Des Moines Register Cartoonists|Papers of Brian Duffy|Des Moines Register",,English,"Still image|Editorial cartoons",MSC916|duffy-031216|http://digital.lib.uiowa.edu/cdm/ref/collection/duffy/id/100,,,,,,,,,,,,,,,,,,,,,,,,,,,,,,,,,,,,,,,,,,,,,,,,"<a href=""http://digital.lib.uiowa.edu/cdm/ref/collection/duffy/id/100"" target=""_blank"">View this item in its source respository</a>",,,,,,,,,,,,,,,,,,,,,,,,,,,,,http://www.iowaheritage.org/files/original/3358bf54e02fc7c6630e6d668310fa98.jpg,"Remote Item","Editorial Cartoons of Brian Duffy",1,0
64263,http://www.iowaheritage.org/items/show/64263,"The automakers plan on lowering the profile of their SUVs so this won't happen anymore","Automobiles|United States|Automobile accidents|2000-2010|Automobile industry and trade|Automobile sales|Supply and demand|Automobile drivers|Families",Splat,"Duffy, Brian, 1955-",,"University of Iowa. Libraries. Special Collections Dept.",2003-12-17|2011-04,,"Educational use only, no other permissions given. Copyright to this digital object is owned by The Des Moines Register; it may not be downloaded, reproduced, or distributed without written permission. For more information, contact the Special Collections Department.","Editorial Cartoons of Brian Duffy; Des Moines Register Cartoonists|Papers of Brian Duffy|Des Moines Register",,English,"Still image|Editorial cartoons","MSC916|duffy-031217 (2)|http://digital.lib.uiowa.edu/cdm/ref/collection/duffy/id/101",,,,,,,,,,,,,,,,,,,,,,,,,,,,,,,,,,,,,,,,,,,,,,,,"<a href=""http://digital.lib.uiowa.edu/cdm/ref/collection/duffy/id/101"" target=""_blank"">View this item in its source respository</a>",,,,,,,,,,,,,,,,,,,,,,,,,,,,,http://www.iowaheritage.org/files/original/93476fa1daac72ccec72e096c4e6c8d7.jpg,"Remote Item","Editorial Cartoons of Brian Duffy",1,0
64264,http://www.iowaheritage.org/items/show/64264,"When once you have tasted flight, you will forever walk the earth with your eyes turned skyward. For there you have been, and there you will always long to return - Leonardo da Vinci","Airplanes|Wright, Wilbur, 1867-1912|United States|Airplanes|2000-2010|Invention|Pioneers|Flight|Wright, Orville, 1871-1948|Men",,"Duffy, Brian, 1955-",,"University of Iowa. Libraries. Special Collections Dept.",2003-12-18|2011-04,,"Educational use only, no other permissions given. Copyright to this digital object is owned by The Des Moines Register; it may not be downloaded, reproduced, or distributed without written permission. For more information, contact the Special Collections Department.","Editorial Cartoons of Brian Duffy; Des Moines Register Cartoonists|Papers of Brian Duffy|Des Moines Register",,English,"Still image|Editorial cartoons",MSC916|duffy-031218|http://digital.lib.uiowa.edu/cdm/ref/collection/duffy/id/102,,,,,,,,,,,,,,,,,,,,,,,,,,,,,,,,,,,,,,,,,,,,,,,,"<a href=""http://digital.lib.uiowa.edu/cdm/ref/collection/duffy/id/102"" target=""_blank"">View this item in its source respository</a>",,,,,,,,,,,,,,,,,,,,,,,,,,,,,http://www.iowaheritage.org/files/original/27e24537670ab9d6ac0c32b0bd1cdeed.jpg,"Remote Item","Editorial Cartoons of Brian Duffy",1,0
64265,http://www.iowaheritage.org/items/show/64265,"You should have watched where you're going, Howard","Candidates|Dean, Howard, 1948-|United States|Men|2000-2010|Campaigns|Campaigning|Presidency|Nominations for office|Democratic Party|Democrats|Governors|Competition|Kerry, John, 1943-|Gephardt, Richard A. (Richard Andrew), 1941-|Lieberman, Joseph I.|Clark, Wesley K.|Graves|Stars|Smoke|Candidates|Trapdoors","That's gonna leave a mark; Hopefully","Duffy, Brian, 1955-",,"University of Iowa. Libraries. Special Collections Dept.",2003-12-17|2011-04,,"Educational use only, no other permissions given. Copyright to this digital object is owned by The Des Moines Register; it may not be downloaded, reproduced, or distributed without written permission. For more information, contact the Special Collections Department.","Editorial Cartoons of Brian Duffy; Des Moines Register Cartoonists|Papers of Brian Duffy|Des Moines Register",,English,"Still image|Editorial cartoons",MSC916|duffy-031217|http://digital.lib.uiowa.edu/cdm/ref/collection/duffy/id/103,,,,,,,,,,,,,,,,,,,,,,,,,,,,,,,,,,,,,,,,,,,,,,,,"<a href=""http://digital.lib.uiowa.edu/cdm/ref/collection/duffy/id/103"" target=""_blank"">View this item in its source respository</a>",,,,,,,,,,,,,,,,,,,,,,,,,,,,,http://www.iowaheritage.org/files/original/85dd4dc3c79649b948053392ea1c0908.jpg,"Remote Item","Editorial Cartoons of Brian Duffy",1,0
64266,http://www.iowaheritage.org/items/show/64266,"It helps speed up the process","Security|United States|Men|2000-2010|Airplanes|Airport terminals|Security checkpoints|Terrorism|Frisking|Women|Children|Airplanes|Airport terminals|Security checkpoints|Luggage|Shoes","Airport security","Duffy, Brian, 1955-",,"University of Iowa. Libraries. Special Collections Dept.",2003-12-19|2011-04,,"Educational use only, no other permissions given. Copyright to this digital object is owned by The Des Moines Register; it may not be downloaded, reproduced, or distributed without written permission. For more information, contact the Special Collections Department.","Editorial Cartoons of Brian Duffy; Des Moines Register Cartoonists|Papers of Brian Duffy|Des Moines Register",,English,"Still image|Editorial cartoons",MSC916|duffy-031219|http://digital.lib.uiowa.edu/cdm/ref/collection/duffy/id/104,,,,,,,,,,,,,,,,,,,,,,,,,,,,,,,,,,,,,,,,,,,,,,,,"<a href=""http://digital.lib.uiowa.edu/cdm/ref/collection/duffy/id/104"" target=""_blank"">View this item in its source respository</a>",,,,,,,,,,,,,,,,,,,,,,,,,,,,,http://www.iowaheritage.org/files/original/16fc91b2d63ccb878cd4404f3fb1d8fc.jpg,"Remote Item","Editorial Cartoons of Brian Duffy",1,0
64267,http://www.iowaheritage.org/items/show/64267,"We borrowed a page from the Republican playbook and decided to charge ourselves silly this Christmas","Spending|United States|Men|2000-2010|Credit|Republican Party|Christmas|Gifts|Congressional spending|Deficits|Women|Presents|Shopping|Shoppers|Bags|Ribbons",,"Duffy, Brian, 1955-",,"University of Iowa. Libraries. Special Collections Dept.",2003-12-03|2011-04,,"Educational use only, no other permissions given. Copyright to this digital object is owned by The Des Moines Register; it may not be downloaded, reproduced, or distributed without written permission. For more information, contact the Special Collections Department.","Editorial Cartoons of Brian Duffy; Des Moines Register Cartoonists|Papers of Brian Duffy|Des Moines Register",,English,"Still image|Editorial cartoons",MSC916|duffy-031203|http://digital.lib.uiowa.edu/cdm/ref/collection/duffy/id/105,,,,,,,,,,,,,,,,,,,,,,,,,,,,,,,,,,,,,,,,,,,,,,,,"<a href=""http://digital.lib.uiowa.edu/cdm/ref/collection/duffy/id/105"" target=""_blank"">View this item in its source respository</a>",,,,,,,,,,,,,,,,,,,,,,,,,,,,,http://www.iowaheritage.org/files/original/6feabb027cab4e561495172e758db7e8.jpg,"Remote Item","Editorial Cartoons of Brian Duffy",1,0
64268,http://www.iowaheritage.org/items/show/64268,"Ho ho ho!","Environment|United States|Santa Claus|2000-2010|Government regulation|Government|Pollution|Coal|Chimneys|Bags|Coal|Smoke","EPA; Clean air rule change; Easing mercury emission rules","Duffy, Brian, 1955-",,"University of Iowa. Libraries. Special Collections Dept.",2003-12-04|2011-04,,"Educational use only, no other permissions given. Copyright to this digital object is owned by The Des Moines Register; it may not be downloaded, reproduced, or distributed without written permission. For more information, contact the Special Collections Department.","Editorial Cartoons of Brian Duffy; Des Moines Register Cartoonists|Papers of Brian Duffy|Des Moines Register",,English,"Still image|Editorial cartoons",MSC916|duffy-031204|http://digital.lib.uiowa.edu/cdm/ref/collection/duffy/id/106,,,,,,,,,,,,,,,,,,,,,,,,,,,,,,,,,,,,,,,,,,,,,,,,"<a href=""http://digital.lib.uiowa.edu/cdm/ref/collection/duffy/id/106"" target=""_blank"">View this item in its source respository</a>",,,,,,,,,,,,,,,,,,,,,,,,,,,,,http://www.iowaheritage.org/files/original/a74bc96de86da51ac57b392f14606a7b.jpg,"Remote Item","Editorial Cartoons of Brian Duffy",1,0
64269,http://www.iowaheritage.org/items/show/64269,"Well, if this presidential thing doesn't pan out, he has a future in the World Wrestling Federation","Candidates|Dean, Howard, 1948-|United States|Men|2000-2010|Campaigns|Speeches|Presidency|Governors|Nominations for office|Media|Women|Candidates|Governors|Televisions|Microphones|Couches|Signs|Yelling|Dogs",Dean,"Duffy, Brian, 1955-",,"University of Iowa. Libraries. Special Collections Dept.",2004-01-21|2011-04,,"Educational use only, no other permissions given. Copyright to this digital object is owned by The Des Moines Register; it may not be downloaded, reproduced, or distributed without written permission. For more information, contact the Special Collections Department.","Editorial Cartoons of Brian Duffy; Des Moines Register Cartoonists|Papers of Brian Duffy|Des Moines Register",,English,"Still image|Editorial cartoons",MSC916|duffy-040121|http://digital.lib.uiowa.edu/cdm/ref/collection/duffy/id/107,,,,,,,,,,,,,,,,,,,,,,,,,,,,,,,,,,,,,,,,,,,,,,,,"<a href=""http://digital.lib.uiowa.edu/cdm/ref/collection/duffy/id/107"" target=""_blank"">View this item in its source respository</a>",,,,,,,,,,,,,,,,,,,,,,,,,,,,,http://www.iowaheritage.org/files/original/1aa222808a9fe58d3ce48a5bf8546cd3.jpg,"Remote Item","Editorial Cartoons of Brian Duffy",1,0
