 




﻿"Item Id","Item URI","Dublin Core:Title","Dublin Core:Subject","Dublin Core:Description","Dublin Core:Creator","Dublin Core:Source","Dublin Core:Publisher","Dublin Core:Date","Dublin Core:Contributor","Dublin Core:Rights","Dublin Core:Relation","Dublin Core:Format","Dublin Core:Language","Dublin Core:Type","Dublin Core:Identifier","Dublin Core:Coverage","Item Type Metadata:Text","Item Type Metadata:Interviewer","Item Type Metadata:Interviewee","Item Type Metadata:Location","Item Type Metadata:Transcription","Item Type Metadata:Local URL","Item Type Metadata:Original Format","Item Type Metadata:Physical Dimensions","Item Type Metadata:Duration","Item Type Metadata:Compression","Item Type Metadata:Producer","Item Type Metadata:Director","Item Type Metadata:Bit Rate/Frequency","Item Type Metadata:Time Summary","Item Type Metadata:Email Body","Item Type Metadata:Subject Line","Item Type Metadata:From","Item Type Metadata:To","Item Type Metadata:CC","Item Type Metadata:BCC","Item Type Metadata:Number of Attachments","Item Type Metadata:Standards","Item Type Metadata:Objectives","Item Type Metadata:Materials","Item Type Metadata:Lesson Plan Text","Item Type Metadata:URL","Item Type Metadata:Event Type","Item Type Metadata:Participants","Item Type Metadata:Birth Date","Item Type Metadata:Birthplace","Item Type Metadata:Death Date","Item Type Metadata:Occupation","Item Type Metadata:Biographical Text","Item Type Metadata:Bibliography","Item Type Metadata:Digital Reproduction Information","Item Type Metadata:Repository","Item Type Metadata:Repository Collection","Item Type Metadata:Contact information.","Item Type Metadata:File Name","Item Type Metadata:Notes","Item Type Metadata:Digital item created","Item Type Metadata:Digital item modified","Item Type Metadata:Executive Orders","Item Type Metadata:Record Created","Item Type Metadata:Record Modified","Item Type Metadata:Transcription2","Item Type Metadata:Source URL","Omeka Legacy File:Additional Creator","Omeka Legacy File:Transcriber","Omeka Legacy File:Producer","Omeka Legacy File:Render Device","Omeka Legacy File:Render Details","Omeka Legacy File:Capture Date","Omeka Legacy File:Capture Device","Omeka Legacy File:Capture Details","Omeka Legacy File:Change History","Omeka Legacy File:Watermark","Omeka Legacy File:Encryption","Omeka Legacy File:Compression","Omeka Legacy File:Post Processing","Omeka Image File:Width","Omeka Image File:Height","Omeka Image File:Bit Depth","Omeka Image File:Channels","Omeka Image File:Exif String","Omeka Image File:Exif Array","Omeka Image File:IPTC String","Omeka Image File:IPTC Array","Omeka Video File:Bitrate","Omeka Video File:Duration","Omeka Video File:Sample Rate","Omeka Video File:Codec","Omeka Video File:Width","Omeka Video File:Height",tags,file,itemType,collection,public,featured
19992,http://www.iowaheritage.org/items/show/19992,"Contributions to friendship train exceed $2,000; county seeks $4,500 in final drive for carload of food|Times (Davenport, Iowa)|Friendship train","Reconstruction (1939-1951) –- Iowa|United States -- Iowa -- Scott Coutny -- Davenport|World War II|Friendship food train|Food relief, American –- Europe",,,,"State Historical Society of Iowa, Iowa City","1947-11-10|1941, 1942, 1943, 1944, 1945, 1946, 1947, 1948, 1949, 1950|2006-02-27",,"This digital image may be used for educational purposes, as long as it is not altered in any way. No commercial reproduction or distribution of this file is permitted without written permission of the State Historical Society of Iowa.","World War II Iowa Press Clippings","image/jpeg; Display image: 557,421 bytes|1 clipping : b&w ; 13 x 11 cm.",eng,"Text; Clippings",1947-11-10.jpg|173848404|https://digital.lib.uiowa.edu/,,,,,,,,,,,,,,,,,,,,,,,,,,,,,,,,,,,,,,,,,,,,,,,,"<a href=""https://digital.lib.uiowa.edu/"" target=""_blank"">View this item in its source respository</a>",,,,,,,,,,,,,,,,,,,,,,,,,,,,,http://www.iowaheritage.org/files/original/137b6784628f6a396d9867fe42713f68.jpg,"Remote Item","World War II Iowa Press Clippings",1,0
19889,http://www.iowaheritage.org/items/show/19889,"Contributors to the ""Friendship Train""|Times (Spencer, Iowa)|Friendship train","Reconstruction (1939-1951) –- Iowa|World War II|Friendship food train|Food relief, American –- Europe",,,,"State Historical Society of Iowa, Iowa City","1947-11-13|1941, 1942, 1943, 1944, 1945, 1946, 1947, 1948, 1949, 1950|2006-02-21",,"This digital image may be used for educational purposes, as long as it is not altered in any way. No commercial reproduction or distribution of this file is permitted without written permission of the State Historical Society of Iowa.","World War II Iowa Press Clippings",,eng,"Text; Clippings",173848404|https://digital.lib.uiowa.edu/,,,,,,,,,,,,,,,,,,,,,,,,,,,,,,,,,,,,,,,,,,,,,,,,"<a href=""https://digital.lib.uiowa.edu/"" target=""_blank"">View this item in its source respository</a>",,,,,,,,,,,,,,,,,,,,,,,,,,,,,http://www.iowaheritage.org/files/original/257333f088a47b15303a246301031302.jpg,"Remote Item","World War II Iowa Press Clippings",1,0
19677,http://www.iowaheritage.org/items/show/19677,"County asked to give a car load|Food stuffs for starving peope of Italy and France is mission of train;  Drew Parson initiates train ideas- Boone County asked to donate a car load|Register News (Madrid, Iowa)|Friendship train","Reconstruction (1939-1951) –- Iowa|United States -- Iowa -- Boone County -- Boone|World War II|Friendship food train|Food relief, American –- Europe",,,,"State Historical Society of Iowa, Iowa City","1947-10-30|1941, 1942, 1943, 1944, 1945, 1946, 1947, 1948, 1949, 1950|2006-02-15",,"This digital image may be used for educational purposes, as long as it is not altered in any way. No commercial reproduction or distribution of this file is permitted without written permission of the State Historical Society of Iowa.","World War II Iowa Press Clippings","image/jpeg; Display image: 530,246 bytes|1 clipping : b&w ;  18 x 12 cm.",eng,"Text; Clippings",1947-10-30-4.jpg|173848404|https://digital.lib.uiowa.edu/,,,,,,,,,,,,,,,,,,,,,,,,,,,,,,,,,,,,,,,,,,,,,,,,"<a href=""https://digital.lib.uiowa.edu/"" target=""_blank"">View this item in its source respository</a>",,,,,,,,,,,,,,,,,,,,,,,,,,,,,http://www.iowaheritage.org/files/original/ef449e91b5865bc5fb8bbb9c87176dc6.jpg,"Remote Item","World War II Iowa Press Clippings",1,0
19602,http://www.iowaheritage.org/items/show/19602,"County auction for Europe|Record (Roland, Iowa)|Friendship train","Reconstruction (1939-1951) –- Iowa|United States -- Iowa -- Hardin County|World War II|Friendship food train|Food relief, American –- Europe",,,,"State Historical Society of Iowa, Iowa City","1947-03-06|1941, 1942, 1943, 1944, 1945, 1946, 1947, 1948, 1949, 1950|2005-10-31",,"This digital image may be used for educational purposes, as long as it is not altered in any way. No commercial reproduction or distribution of this file is permitted without written permission of the State Historical Society of Iowa.","World War II Iowa Press Clippings","image/jpeg; Display image: 382,747 bytes|1 clipping : b&w ; 9 x 6 cm.",eng,"Text; Clippings",1947-03-06.jpg|173848404|https://digital.lib.uiowa.edu/,,,,,,,,,,,,,,,,,,,,,,,,,,,,,,,,,,,,,,,,,,,,,,,,"<a href=""https://digital.lib.uiowa.edu/"" target=""_blank"">View this item in its source respository</a>",,,,,,,,,,,,,,,,,,,,,,,,,,,,,http://www.iowaheritage.org/files/original/4d97ddcabfd49c6748cf5da92272be2f.jpg,"Remote Item","World War II Iowa Press Clippings",1,0
20337,http://www.iowaheritage.org/items/show/20337,"County to stage new aid drive|Freeman-Journal (Webster City, Iowa)|Friendship train","Reconstruction (1939-1951) –- Iowa|United States -- Iowa -- Hamilton County|World War II|Friendship food train|Food relief, American –- Europe",,,,"State Historical Society of Iowa, Iowa City","1948-01-28|1941, 1942, 1943, 1944, 1945, 1946, 1947, 1948, 1949, 1950|2006-03-07",,"This digital image may be used for educational purposes, as long as it is not altered in any way. No commercial reproduction or distribution of this file is permitted without written permission of the State Historical Society of Iowa.","World War II Iowa Press Clippings","image/jpeg; Display image: 426,810 bytes|1 clipping : b&w ; 25 x 6 cm.",eng,"Text; Clippings","1948-01-28-2 .JPG|173848404|https://digital.lib.uiowa.edu/",,,,,,,,,,,,,,,,,,,,,,,,,,,,,,,,,,,,,,,,,,,,,,,,"<a href=""https://digital.lib.uiowa.edu/"" target=""_blank"">View this item in its source respository</a>",,,,,,,,,,,,,,,,,,,,,,,,,,,,,http://www.iowaheritage.org/files/original/8ff3c1e8c931b0b94e357aef3ed3a5e1.jpg,"Remote Item","World War II Iowa Press Clippings",1,0
19883,http://www.iowaheritage.org/items/show/19883,"Crowd at ceremonies|Nonpareil (Council Bluffs, Iowa)|Friendship train","Reconstruction (1939-1951) –- Iowa|World War II|Friendship food train|Food relief, American –- Europe",,,,"State Historical Society of Iowa, Iowa City","1947-11-13|1941, 1942, 1943, 1944, 1945, 1946, 1947, 1948, 1949, 1950|2006-02-21",,"This digital image may be used for educational purposes, as long as it is not altered in any way. No commercial reproduction or distribution of this file is permitted without written permission of the State Historical Society of Iowa.","World War II Iowa Press Clippings",,eng,"Still image; Text; Clippings",173848404|https://digital.lib.uiowa.edu/,,,,,,,,,,,,,,,,,,,,,,,,,,,,,,,,,,,,,,,,,,,,,,,,"<a href=""https://digital.lib.uiowa.edu/"" target=""_blank"">View this item in its source respository</a>",,,,,,,,,,,,,,,,,,,,,,,,,,,,,http://www.iowaheritage.org/files/original/509715f56908f4bc0a51bf5785ee4c7b.jpg,"Remote Item","World War II Iowa Press Clippings",1,0
20339,http://www.iowaheritage.org/items/show/20339,"Dallas County school children asked to help|News (Adel, Iowa)|Friendship train","Reconstruction (1939-1951) –- Iowa|United States -- Iowa -- Dallas County|World War II|Friendship food train|Food relief, American –- Europe",,,,"State Historical Society of Iowa, Iowa City","1948-01-28|1941, 1942, 1943, 1944, 1945, 1946, 1947, 1948, 1949, 1950|2006-03-07",,"This digital image may be used for educational purposes, as long as it is not altered in any way. No commercial reproduction or distribution of this file is permitted without written permission of the State Historical Society of Iowa.","World War II Iowa Press Clippings","image/jpeg; Display image: 713,410 bytes|1 clipping : b&w ; 10 x 11 cm.",eng,"Text; Clippings","1948-01-28 .JPG|173848404|https://digital.lib.uiowa.edu/",,,,,,,,,,,,,,,,,,,,,,,,,,,,,,,,,,,,,,,,,,,,,,,,"<a href=""https://digital.lib.uiowa.edu/"" target=""_blank"">View this item in its source respository</a>",,,,,,,,,,,,,,,,,,,,,,,,,,,,,http://www.iowaheritage.org/files/original/b75c70730ce0b89d2560ecb78319a5cd.jpg,"Remote Item","World War II Iowa Press Clippings",1,0
19753,http://www.iowaheritage.org/items/show/19753,"Deadline near for train fund|Collection here is $160.50 today|News Advertiser (Creston, Iowa)|Friendship train","Reconstruction (1939-1951) –- Iowa|United States -- Iowa|World War II|Friendship food train|Food relief, American –- Europe",,,,"State Historical Society of Iowa, Iowa City","1947-11-12|1941, 1942, 1943, 1944, 1945, 1946, 1947, 1948, 1949, 1950|2006-02-14",,"This digital image may be used for educational purposes, as long as it is not altered in any way. No commercial reproduction or distribution of this file is permitted without written permission of the State Historical Society of Iowa.","World War II Iowa Press Clippings","image/jpeg; Display image: 315,850 bytes|1 clipping : b&w ; 15 x 10 cm.",eng,"Text; Clippings",1947-11-12-08.jpg|173848404|https://digital.lib.uiowa.edu/,,,,,,,,,,,,,,,,,,,,,,,,,,,,,,,,,,,,,,,,,,,,,,,,"<a href=""https://digital.lib.uiowa.edu/"" target=""_blank"">View this item in its source respository</a>",,,,,,,,,,,,,,,,,,,,,,,,,,,,,http://www.iowaheritage.org/files/original/370ef3f7c903b99899598556faf95fb9.jpg,"Remote Item","World War II Iowa Press Clippings",1,0
19932,http://www.iowaheritage.org/items/show/19932,"Decides on 'quick action' to get Iowa City's contribution|Iowan (Iowa City, Iowa)|Friendship train","Reconstruction (1939-1951) –- Iowa|United States -- Iowa -- Johnson County -- Iowa City|World War II|Friendship food train|Food relief, American –- Europe",,,,"State Historical Society of Iowa, Iowa City","1947-11-04|1941, 1942, 1943, 1944, 1945, 1946, 1947, 1948, 1949, 1950|2006-02-20",,"This digital image may be used for educational purposes, as long as it is not altered in any way. No commercial reproduction or distribution of this file is permitted without written permission of the State Historical Society of Iowa.","World War II Iowa Press Clippings","image/jpeg; Display image: 482,553 bytes|1 clipping : b&w ; 18 x 11 cm.",eng,"Text; Clippings",1947-11-04-6.jpg|173848404|https://digital.lib.uiowa.edu/,,,,,,,,,,,,,,,,,,,,,,,,,,,,,,,,,,,,,,,,,,,,,,,,"<a href=""https://digital.lib.uiowa.edu/"" target=""_blank"">View this item in its source respository</a>",,,,,,,,,,,,,,,,,,,,,,,,,,,,,http://www.iowaheritage.org/files/original/9251a575c63be03a4af7db3ee35540da.jpg,"Remote Item","World War II Iowa Press Clippings",1,0
19638,http://www.iowaheritage.org/items/show/19638,"DeWitt friendship train delegation|Democrat (Davenport, Iowa)|Friendship train","Reconstruction (1939-1951) –- Iowa|United States -- Iowa -- Clinton County|World War II|Friendship food train|Food relief, American –- Europe","Image of five men standing in line",,,"State Historical Society of Iowa, Iowa City","1947-11-14|1941, 1942, 1943, 1944, 1945, 1946, 1947, 1948, 1949, 1950|2006-02-09",,"This digital image may be used for educational purposes, as long as it is not altered in any way. No commercial reproduction or distribution of this file is permitted without written permission of the State Historical Society of Iowa.","World War II Iowa Press Clippings","image/jpeg; Display image: 673,731 bytes|1 clipping : b&w ; 11 x 15 cm.",eng,"Still Image; Text; Clippings",1947-11-14-8.jpg|173848404|https://digital.lib.uiowa.edu/,,,,,,,,,,,,,,,,,,,,,,,,,,,,,,,,,,,,,,,,,,,,,,,,"<a href=""https://digital.lib.uiowa.edu/"" target=""_blank"">View this item in its source respository</a>",,,,,,,,,,,,,,,,,,,,,,,,,,,,,http://www.iowaheritage.org/files/original/8c749e62f5d26f95be189e87cc959ffe.jpg,"Remote Item","World War II Iowa Press Clippings",1,0
