 




﻿"Item Id","Item URI","Dublin Core:Title","Dublin Core:Subject","Dublin Core:Description","Dublin Core:Creator","Dublin Core:Source","Dublin Core:Publisher","Dublin Core:Date","Dublin Core:Contributor","Dublin Core:Rights","Dublin Core:Relation","Dublin Core:Format","Dublin Core:Language","Dublin Core:Type","Dublin Core:Identifier","Dublin Core:Coverage","Item Type Metadata:Text","Item Type Metadata:Interviewer","Item Type Metadata:Interviewee","Item Type Metadata:Location","Item Type Metadata:Transcription","Item Type Metadata:Local URL","Item Type Metadata:Original Format","Item Type Metadata:Physical Dimensions","Item Type Metadata:Duration","Item Type Metadata:Compression","Item Type Metadata:Producer","Item Type Metadata:Director","Item Type Metadata:Bit Rate/Frequency","Item Type Metadata:Time Summary","Item Type Metadata:Email Body","Item Type Metadata:Subject Line","Item Type Metadata:From","Item Type Metadata:To","Item Type Metadata:CC","Item Type Metadata:BCC","Item Type Metadata:Number of Attachments","Item Type Metadata:Standards","Item Type Metadata:Objectives","Item Type Metadata:Materials","Item Type Metadata:Lesson Plan Text","Item Type Metadata:URL","Item Type Metadata:Event Type","Item Type Metadata:Participants","Item Type Metadata:Birth Date","Item Type Metadata:Birthplace","Item Type Metadata:Death Date","Item Type Metadata:Occupation","Item Type Metadata:Biographical Text","Item Type Metadata:Bibliography","Item Type Metadata:Digital Reproduction Information","Item Type Metadata:Repository","Item Type Metadata:Repository Collection","Item Type Metadata:Contact information.","Item Type Metadata:File Name","Item Type Metadata:Notes","Item Type Metadata:Digital item created","Item Type Metadata:Digital item modified","Item Type Metadata:Executive Orders","Item Type Metadata:Record Created","Item Type Metadata:Record Modified","Item Type Metadata:Transcription2","Item Type Metadata:Source URL","Omeka Legacy File:Additional Creator","Omeka Legacy File:Transcriber","Omeka Legacy File:Producer","Omeka Legacy File:Render Device","Omeka Legacy File:Render Details","Omeka Legacy File:Capture Date","Omeka Legacy File:Capture Device","Omeka Legacy File:Capture Details","Omeka Legacy File:Change History","Omeka Legacy File:Watermark","Omeka Legacy File:Encryption","Omeka Legacy File:Compression","Omeka Legacy File:Post Processing","Omeka Image File:Width","Omeka Image File:Height","Omeka Image File:Bit Depth","Omeka Image File:Channels","Omeka Image File:Exif String","Omeka Image File:Exif Array","Omeka Image File:IPTC String","Omeka Image File:IPTC Array","Omeka Video File:Bitrate","Omeka Video File:Duration","Omeka Video File:Sample Rate","Omeka Video File:Codec","Omeka Video File:Width","Omeka Video File:Height",tags,file,itemType,collection,public,featured
26622,http://www.iowaheritage.org/items/show/26622,"WACs arrive today to open permanent recruiting and induction station here|Herald (Clinton, Iowa)|Women's military activity","United States. Army. Women's Army Corps|United States -- Iowa -- Clinton County -- Clinton|World War II|World War, 1939-1945 -- Participation, Female|Women soldiers -- Iowa -- Fort Des Moines","Images of two WAC recruiters accompany article.",,,"State Historical Society of Iowa, Iowa City","1943-11-08|1941; 1942; 1943; 1944; 1945; 1946; 1947; 1948; 1949; 1950|2007-06-25",,"This digital image may be used for educational purposes, as long as it is not altered in any way. No commercial reproduction or distribution of this file is permitted without written permission of the State Historical Society of Iowa.","World War II Iowa Press Clippings","image/jpeg|1 clipping : b&w ; 18 x 10 cm",eng,"Text; Clippings; Still Image",1943-11-08-02.jpg|173848404|https://digital.lib.uiowa.edu/,,,,,,,,,,,,,,,,,,,,,,,,,,,,,,,,,,,,,,,,,,,,,,,,"<a href=""https://digital.lib.uiowa.edu/"" target=""_blank"">View this item in its source respository</a>",,,,,,,,,,,,,,,,,,,,,,,,,,,,,http://www.iowaheritage.org/files/original/91c2cba102ad9f0229aa3af488d3d091.jpg,"Remote Item","World War II Iowa Press Clippings",1,0
26521,http://www.iowaheritage.org/items/show/26521,"WACs on duty at showing of movie|Herald (Clinton, Iowa)|Women's military activity","United States. Army. Women's Army Corps|United States -- Iowa -- Clinton County -- Clinton|World War II|World War, 1939-1945 -- Participation, Female|Women soldiers -- Iowa -- Fort Des Moines",,,,"State Historical Society of Iowa, Iowa City","1943-11-20|1941; 1942; 1943; 1944; 1945; 1946; 1947; 1948; 1949; 1950|2007-06-26",,"This digital image may be used for educational purposes, as long as it is not altered in any way. No commercial reproduction or distribution of this file is permitted without written permission of the State Historical Society of Iowa.","World War II Iowa Press Clippings","image/jpeg|1 clipping : b&w ; 11 x 5 cm",eng,"Text; Clippings",1943-11-20-03.jpg|173848404|https://digital.lib.uiowa.edu/,,,,,,,,,,,,,,,,,,,,,,,,,,,,,,,,,,,,,,,,,,,,,,,,"<a href=""https://digital.lib.uiowa.edu/"" target=""_blank"">View this item in its source respository</a>",,,,,,,,,,,,,,,,,,,,,,,,,,,,,http://www.iowaheritage.org/files/original/147c63d936add074099cf410a2187ac1.jpg,"Remote Item","World War II Iowa Press Clippings",1,0
29116,http://www.iowaheritage.org/items/show/29116,"WACS visit Shick hospital|Herald (Stuart, Iowa)|Women's military activity","Women|World War, 1939-1945|United States. Army. Women's Army Corps|United States -- Iowa -- Clinton County -- Clinton|1940-1950|World War II|Soldiers|World War, 1939-1945 -- Participation, Female|Women soldiers -- Iowa",,,,"State Historical Society of Iowa, Iowa City",1945-03-15,,"This digital image may be used for educational purposes, as long as it is not altered in any way.  No commercial reproduction or distribution of this file is permitted without written permission of the State Historical Society of Iowa","World War II Iowa press clippings","Jpeg|image/jpeg|1 clipping : b&w ; 22 x 6 cm",eng,"Clippings; Text|Text|Clippings (Information Artifacts)",1945-03-15-08.jpg|https://digital.lib.uiowa.edu/,,,,,,,,,,,,,,,,,,,,,,,,,,,,,,,,,,,,,,,,,,,,,,,,"<a href=""https://digital.lib.uiowa.edu/"" target=""_blank"">View this item in its source respository</a>",,,,,,,,,,,,,,,,,,,,,,,,,,,,,http://www.iowaheritage.org/files/original/5a4a5534215d79ac19135b4dfc8f87df.jpg,"Remote Item","World War II Iowa Press Clippings",1,0
29032,http://www.iowaheritage.org/items/show/29032,"Want women for medical corps to serve in Iowa|Hawkeye (Burlington, Iowa)|Women's military activity","Women|World War, 1939-1945|United States. Army. Women's Army Corps|United States -- Iowa -- Clinton County -- Clinton|1940-1950|World War II|Soldiers|World War, 1939-1945 -- Participation, Female|Women soldiers -- Iowa",,,,"State Historical Society of Iowa, Iowa City",1945-02-06,,"This digital image may be used for educational purposes, as long as it is not altered in any way.  No commercial reproduction or distribution of this file is permitted without written permission of the State Historical Society of Iowa","World War II Iowa press clippings","Jpeg|image/jpeg|1 clipping : b&w ; 8 x 5 cm",eng,"Clippings; Text|Text|Clippings (Information Artifacts)",1945-02-06-02.jpg|https://digital.lib.uiowa.edu/,,,,,,,,,,,,,,,,,,,,,,,,,,,,,,,,,,,,,,,,,,,,,,,,"<a href=""https://digital.lib.uiowa.edu/"" target=""_blank"">View this item in its source respository</a>",,,,,,,,,,,,,,,,,,,,,,,,,,,,,http://www.iowaheritage.org/files/original/a12f4decc4541f1255e241599ac63e54.jpg,"Remote Item","World War II Iowa Press Clippings",1,0
27280,http://www.iowaheritage.org/items/show/27280,"WAVE is coming|Herald (Clinton, Iowa)|Women's military activity","United States. Naval Reserve. Women's Reserve|United States -- Iowa -- Clinton County -- Clinton|World War II|World War, 1939-1945 -- Participation, Female|Women soldiers -- Iowa","Image of WAVE Eleanor Hanson accompanies article.",,,"State Historical Society of Iowa, Iowa City","1944-02-05|1941;  1942;  1943;  1944;  1945;  1946;  1947;  1948;  1949;  1950|2007-11-08",,"This digital image may be used for educational purposes, as long as it is not altered in any way. No commercial reproduction or distribution of this file is permitted without written permission of the State Historical Society of Iowa.","World War II Iowa Press Clippings","image/jpeg|1 clipping : b&w ; 12 x 5 cm.",eng,"Text; Clippings; Still Image",1944-02-05-02.jpg|173848404|https://digital.lib.uiowa.edu/,,,,,,,,,,,,,,,,,,,,,,,,,,,,,,,,,,,,,,,,,,,,,,,,"<a href=""https://digital.lib.uiowa.edu/"" target=""_blank"">View this item in its source respository</a>",,,,,,,,,,,,,,,,,,,,,,,,,,,,,http://www.iowaheritage.org/files/original/b8b21de299c9a52164a711308b0543ef.jpg,"Remote Item","World War II Iowa Press Clippings",1,0
27402,http://www.iowaheritage.org/items/show/27402,"WAVES office here closes|Herald (Clinton, Iowa)|Women's military activity","United States. Naval Reserve. Women's Reserve|United States -- Iowa -- Clinton County -- Clinton|World War II|World War, 1939-1945 -- Participation, Female|Women soldiers -- Iowa",,,,"State Historical Society of Iowa, Iowa City","1944-03-13|1941;  1942;  1943;  1944;  1945;  1946;  1947;  1948;  1949;  1950|2007-11-08",,"This digital image may be used for educational purposes, as long as it is not altered in any way. No commercial reproduction or distribution of this file is permitted without written permission of the State Historical Society of Iowa.","World War II Iowa Press Clippings","image/jpeg|1 clipping : b&w ; 6 x 6 cm.",eng,"Text; Clippings",1944-03-13-03.jpg|173848404|https://digital.lib.uiowa.edu/,,,,,,,,,,,,,,,,,,,,,,,,,,,,,,,,,,,,,,,,,,,,,,,,"<a href=""https://digital.lib.uiowa.edu/"" target=""_blank"">View this item in its source respository</a>",,,,,,,,,,,,,,,,,,,,,,,,,,,,,http://www.iowaheritage.org/files/original/4c8c7b135705dd3ff91437865868d531.jpg,"Remote Item","World War II Iowa Press Clippings",1,0
27710,http://www.iowaheritage.org/items/show/27710,"WAVES to seek members here|Special recruiting party will spend Monday in Clinton|Herald (Clinton, Iowa)|Women's military activity","United States. Naval Reserve. Women's Reserve|United States -- Iowa -- Clinton County -- Clinton|World War II|World War, 1939-1945 -- Participation, Female|Women soldiers -- Iowa",,,,"State Historical Society of Iowa, Iowa City",1944-05-06,,"This digital image may be used for educational purposes, as long as it is not altered in any way.  No commercial reproduction or distribution of this file is permitted without written permission of the State Historical Society of Iowa","World War II Iowa Press Clippings","image/jpeg|1 clipping : b&w ; 21 x 5 cm",eng,"Text; Clippings",1944-05-06-03.jpg|https://digital.lib.uiowa.edu/,,,,,,,,,,,,,,,,,,,,,,,,,,,,,,,,,,,,,,,,,,,,,,,,"<a href=""https://digital.lib.uiowa.edu/"" target=""_blank"">View this item in its source respository</a>",,,,,,,,,,,,,,,,,,,,,,,,,,,,,http://www.iowaheritage.org/files/original/9e573f8078dbe976aedcd44bc80a5588.jpg,"Remote Item","World War II Iowa Press Clippings",1,0
24559,http://www.iowaheritage.org/items/show/24559,"Women's groups to aid WAAC drive|Herald (Clinton, Iowa)|Women's military activity","United States. Army. Women's Army Auxiliary Corps|United States -- Iowa -- Polk County -- Fort Des Moines|World War II|World War, 1939-1945 -- Participation, Female|Women soldiers -- Iowa -- Fort Des Moines|United States -- Iowa -- Clinton County -- Clinton",,,,"State Historical Society of Iowa, Iowa City","1943-03-05|1941;  1942;  1943;  1944;  1945;  1946;  1947;  1948;  1949;  1950|2006-11-27",,"This digital image may be used for educational purposes, as long as it is not altered in any way. No commercial reproduction or distribution of this file is permitted without written permission of the State Historical Society of Iowa.","World War II Iowa Press Clippings","image/jpeg|1 clipping : b&w ; 7 x 5 cm.",eng,"Text; Clippings",1943-03-05-02.jpg|173848404|https://digital.lib.uiowa.edu/,,,,,,,,,,,,,,,,,,,,,,,,,,,,,,,,,,,,,,,,,,,,,,,,"<a href=""https://digital.lib.uiowa.edu/"" target=""_blank"">View this item in its source respository</a>",,,,,,,,,,,,,,,,,,,,,,,,,,,,,http://www.iowaheritage.org/files/original/700eac663d1ae9f0ae567dfffd8472d2.jpg,"Remote Item","World War II Iowa Press Clippings",1,0
20076,http://www.iowaheritage.org/items/show/20076,"Your dollars riding the friendship train spell life to starving Europe|Herald (Clinton, Iowa)|Friendship train","Reconstruction (1939-1951) –- Iowa|United States -- Iowa -- Clinton County -- Clinton|World War II|Friendship food train|Food relief, American –- Europe",,,,"State Historical Society of Iowa, Iowa City","1947-11-05|1941, 1942, 1943, 1944, 1945, 1946, 1947, 1948, 1949, 1950|2006-02-22",,"This digital image may be used for educational purposes, as long as it is not altered in any way. No commercial reproduction or distribution of this file is permitted without written permission of the State Historical Society of Iowa.","World War II Iowa Press Clippings","image/jpeg; Display image: 361,439 bytes|1 clipping : b&w ; 19 x 16 cm.",eng,"Text; Clippings",1947-11-05-9.jpg|173848404|https://digital.lib.uiowa.edu/,,,,,,,,,,,,,,,,,,,,,,,,,,,,,,,,,,,,,,,,,,,,,,,,"<a href=""https://digital.lib.uiowa.edu/"" target=""_blank"">View this item in its source respository</a>",,,,,,,,,,,,,,,,,,,,,,,,,,,,,http://www.iowaheritage.org/files/original/567b9c84c3f6b19e52a48d3104bbad0f.jpg,"Remote Item","World War II Iowa Press Clippings",1,0
