 




﻿"Item Id","Item URI","Dublin Core:Title","Dublin Core:Subject","Dublin Core:Description","Dublin Core:Creator","Dublin Core:Source","Dublin Core:Publisher","Dublin Core:Date","Dublin Core:Contributor","Dublin Core:Rights","Dublin Core:Relation","Dublin Core:Format","Dublin Core:Language","Dublin Core:Type","Dublin Core:Identifier","Dublin Core:Coverage","Item Type Metadata:Text","Item Type Metadata:Interviewer","Item Type Metadata:Interviewee","Item Type Metadata:Location","Item Type Metadata:Transcription","Item Type Metadata:Local URL","Item Type Metadata:Original Format","Item Type Metadata:Physical Dimensions","Item Type Metadata:Duration","Item Type Metadata:Compression","Item Type Metadata:Producer","Item Type Metadata:Director","Item Type Metadata:Bit Rate/Frequency","Item Type Metadata:Time Summary","Item Type Metadata:Email Body","Item Type Metadata:Subject Line","Item Type Metadata:From","Item Type Metadata:To","Item Type Metadata:CC","Item Type Metadata:BCC","Item Type Metadata:Number of Attachments","Item Type Metadata:Standards","Item Type Metadata:Objectives","Item Type Metadata:Materials","Item Type Metadata:Lesson Plan Text","Item Type Metadata:URL","Item Type Metadata:Event Type","Item Type Metadata:Participants","Item Type Metadata:Birth Date","Item Type Metadata:Birthplace","Item Type Metadata:Death Date","Item Type Metadata:Occupation","Item Type Metadata:Biographical Text","Item Type Metadata:Bibliography","Item Type Metadata:Digital Reproduction Information","Item Type Metadata:Repository","Item Type Metadata:Repository Collection","Item Type Metadata:Contact information.","Item Type Metadata:File Name","Item Type Metadata:Notes","Item Type Metadata:Digital item created","Item Type Metadata:Digital item modified","Item Type Metadata:Executive Orders","Item Type Metadata:Record Created","Item Type Metadata:Record Modified","Item Type Metadata:Transcription2","Item Type Metadata:Source URL","Omeka Legacy File:Additional Creator","Omeka Legacy File:Transcriber","Omeka Legacy File:Producer","Omeka Legacy File:Render Device","Omeka Legacy File:Render Details","Omeka Legacy File:Capture Date","Omeka Legacy File:Capture Device","Omeka Legacy File:Capture Details","Omeka Legacy File:Change History","Omeka Legacy File:Watermark","Omeka Legacy File:Encryption","Omeka Legacy File:Compression","Omeka Legacy File:Post Processing","Omeka Image File:Width","Omeka Image File:Height","Omeka Image File:Bit Depth","Omeka Image File:Channels","Omeka Image File:Exif String","Omeka Image File:Exif Array","Omeka Image File:IPTC String","Omeka Image File:IPTC Array","Omeka Video File:Bitrate","Omeka Video File:Duration","Omeka Video File:Sample Rate","Omeka Video File:Codec","Omeka Video File:Width","Omeka Video File:Height",tags,file,itemType,collection,public,featured
64491,http://www.iowaheritage.org/items/show/64491,"Anti-tobacco legislation","Legislation|Miller, Tom|Iowa|Doors|1990-2000|Legislature|Lawyers|State governments|State politics|States|Tobacco|Des Moines (Iowa)|Men|Lawyers|Cigarettes|Signs","Attorney general Miller; Thunk; Legislature; Closed come back in January","Duffy, Brian, 1955-",,"University of Iowa. Libraries. Special Collections Dept.",1997-09-21|2011-04,,"Educational use only, no other permissions given. Copyright to this digital object is owned by The Des Moines Register; it may not be downloaded, reproduced, or distributed without written permission. For more information, contact the Special Collections Department.","Editorial Cartoons of Brian Duffy; Des Moines Register Cartoonists|Papers of Brian Duffy|Des Moines Register",,English,"Still image|Editorial cartoons",MSC916|duffy-970921|http://digital.lib.uiowa.edu/cdm/ref/collection/duffy/id/329,,,,,,,,,,,,,,,,,,,,,,,,,,,,,,,,,,,,,,,,,,,,,,,,"<a href=""http://digital.lib.uiowa.edu/cdm/ref/collection/duffy/id/329"" target=""_blank"">View this item in its source respository</a>",,,,,,,,,,,,,,,,,,,,,,,,,,,,,http://www.iowaheritage.org/files/original/8556934164d042848d0d112ce5497dc4.jpg,"Remote Item","Editorial Cartoons of Brian Duffy",1,0
78930,http://www.iowaheritage.org/items/show/78930,"Archie Wymore in His Brush Runabout in Rose Hill, Iowa, Circa 1910","Archie Wymore|Brush Runabout|Rose Hill|Iowa|Mahaska County|Early 20th Century|Veterinarian","In this photograph sits long-time Rose Hill, Iowa veterinarian Archie Wymore with his wife and dog in one of the earliest automobiles ever manufactured; the Brush Runabout.  Alanson P. Brush established his automobile company in 1907 after designing the first Cadillac.  The first Brush Runabout had a single cylinder six horse power motor and was sold for $500.00.  The axles of the vehicle were made of wood, showing how primitive the vehicle was.  Still, very few in the Mahaska County area could afford a vehicle like this, so posing in the Brush Runabout as Archie Wymore and his family do in this photo, would be a form of showing status at the time.","Chuck Russell","Chuck Russell","Chuck Russell","""2009-06-05""",,,,"still image/jpeg 2000",,image,"www.wmpenn.edu/library/about.html|http://cdm16125.contentdm.oclc.org/u?/p270701coll6,210",,,,,,,,,,,,,,,,,,,,,,,,,,,,,,,,,,,,,,,,,,,,,,,,"<a href=""http://cdm16125.contentdm.oclc.org/u?/p270701coll6,210"" target=""_blank"">View this item in its source respository</a>",,,,,,,,,,,,,,,,,,,,,,,,,,,,,http://www.iowaheritage.org/files/original/355adac8263dc2b047474bd6d0902b31.jpg,"Remote Item","Mahaska History",1,0
64606,http://www.iowaheritage.org/items/show/64606,"Are those footsteps I hear?","Primaries|Avenson, Donald|Iowa|Men|1990-2000|Politicians|Politics|Campaigning|Campaigns|Governors|States|State governments|Miller, Tom|Running|Races|Sweating","Clomp; Clomp; Womp; Womp; Avenson; Miller","Duffy, Brian, 1955-",,"University of Iowa. Libraries. Special Collections Dept.",1990-03-22|2011-04,,"Educational use only, no other permissions given. Copyright to this digital object is owned by The Des Moines Register; it may not be downloaded, reproduced, or distributed without written permission. For more information, contact the Special Collections Department.","Editorial Cartoons of Brian Duffy; Des Moines Register Cartoonists|Papers of Brian Duffy|Des Moines Register",,English,"Still image|Editorial cartoons",MSC916|duffy-900322|http://digital.lib.uiowa.edu/cdm/ref/collection/duffy/id/444,,,,,,,,,,,,,,,,,,,,,,,,,,,,,,,,,,,,,,,,,,,,,,,,"<a href=""http://digital.lib.uiowa.edu/cdm/ref/collection/duffy/id/444"" target=""_blank"">View this item in its source respository</a>",,,,,,,,,,,,,,,,,,,,,,,,,,,,,http://www.iowaheritage.org/files/original/e84ac350f7088714212ca52ada90d80a.jpg,"Remote Item","Editorial Cartoons of Brian Duffy",1,0
64172,http://www.iowaheritage.org/items/show/64172,"Are you better off than you were 7 years ago?","Candidates|Gore, Albert, 1948-|Iowa|Candidates|2000-2010|Caucus|Presidency|Campaigns|Mudslinging|Democrats|Democratic Party|Nominations for office|Bradley, Bill, 1943-|Senators|Men|Pigs|Fences","Did you know that he voted against ethanol and flood relief, ... and he's from New Jersey!; Is it January 24th yet?; ?","Duffy, Brian, 1955-",,"University of Iowa. Libraries. Special Collections Dept.",2000-01-11|2011-04,,"Educational use only, no other permissions given. Copyright to this digital object is owned by The Des Moines Register; it may not be downloaded, reproduced, or distributed without written permission. For more information, contact the Special Collections Department.","Editorial Cartoons of Brian Duffy; Des Moines Register Cartoonists|Papers of Brian Duffy|Des Moines Register",,English,"Still image|Editorial cartoons",MSC916|duffy-000111|http://digital.lib.uiowa.edu/cdm/ref/collection/duffy/id/10,,,,,,,,,,,,,,,,,,,,,,,,,,,,,,,,,,,,,,,,,,,,,,,,"<a href=""http://digital.lib.uiowa.edu/cdm/ref/collection/duffy/id/10"" target=""_blank"">View this item in its source respository</a>",,,,,,,,,,,,,,,,,,,,,,,,,,,,,http://www.iowaheritage.org/files/original/5a21e4be24fb7a674a4d65cac1045889.jpg,"Remote Item","Editorial Cartoons of Brian Duffy",1,0
78842,http://www.iowaheritage.org/items/show/78842,"Armistice Day Parade, November, 1918; Oskaloosa; Iowa;","World War I|1918|Oskaloosa|Iowa|Parade|Float|Armistice Day|H.S. Rhynsburger","On the eleventh hour of the eleventh day in the eleventh month of 1918, the Allies successfully signed an armistice agreement with Germany in Rethondes, France.  Aside from huge celebration for this occasion across Europe, Asia, Africa, and the Middle East, the United States also shared in this celebration.  As an example of that, pictured here is a float that participated in the Armistice Day parade that followed the treaty in Oskaloosa, Iowa.  This sight would have been a familiar one across America in the days and weeks that ensued following Germany's surrender.  This particular float was sponsored by H.S. Rhynsburger's poultry, eggs, and cream establishment, allowing them to creatively advertise their business while also celebrating the end of World War I.","Chuck Russell","Chuck Russell","Chuck Russell","""2009-02-28""",,www.wmpenn.edu/library/about.html,,"still image/jpeg",,image,"www.wmpenn.edu/library/about.html|http://cdm16125.contentdm.oclc.org/u?/p270701coll6,165",,,,,,,,,,,,,,,,,,,,,,,,,,,,,,,,,,,,,,,,,,,,,,,,"<a href=""http://cdm16125.contentdm.oclc.org/u?/p270701coll6,165"" target=""_blank"">View this item in its source respository</a>",,,,,,,,,,,,,,,,,,,,,,,,,,,,,http://www.iowaheritage.org/files/original/aff5d4960abc229a0adb0854f00805f9.jpg,"Remote Item","Mahaska History",1,0
78844,http://www.iowaheritage.org/items/show/78844,"Armistice Day, November, 1918; Downtown Oskaloosa; Iowa","World War I|1918|Oskaloosa|Iowa|Town Square|Armistice Day","On the eleventh hour of the eleventh day in the eleventh month of 1918, the Allies successfully signed an armistice agreement with Germany in Rethondes, France.  Aside from huge celebration for this occasion across Europe, Asia, and the Middle East, the United States also shared in this celebration.  This image reflects that celebratory feeling, as hundreds gathered in and around the famous Oskaloosa, Iowa town square to rejoice the end of World War I, knowing that fathers and sons would soon be coming home to reunite with families.","Chuck Russell","Chuck Russell","Chuck Russell","""2009-02-28""",,www.wmpenn.edu/library/about.html,,"still image/jpeg",,image,"www.wmpenn.edu/library/about.html|http://cdm16125.contentdm.oclc.org/u?/p270701coll6,166",,,,,,,,,,,,,,,,,,,,,,,,,,,,,,,,,,,,,,,,,,,,,,,,"<a href=""http://cdm16125.contentdm.oclc.org/u?/p270701coll6,166"" target=""_blank"">View this item in its source respository</a>",,,,,,,,,,,,,,,,,,,,,,,,,,,,,http://www.iowaheritage.org/files/original/59a4b4119ddb48573b72f4e083832d25.jpg,"Remote Item","Mahaska History",1,0
79449,http://www.iowaheritage.org/items/show/79449,"Arthur Love's Musical Comedy Company",Oskaloosa|Iowa,"Arthur Love's Musical Comedy Company was the band C. L. Barnhouse was formally a part of, pictured second from the left.",,"C. L. Barnhouse Company","William Penn University; Wilcox Library Digital Archives",1890?,,www.wmpenn.edu/library/library.html,,image/jpeg,,image,"http://cdm16125.contentdm.oclc.org/u?/p16125coll6,7",,,,,,,,,,,,,,,,,,,,,,,,,,,,,,,,,,,,,,,,,,,,,,,,"<a href=""http://cdm16125.contentdm.oclc.org/u?/p16125coll6,7"" target=""_blank"">View this item in its source respository</a>",,,,,,,,,,,,,,,,,,,,,,,,,,,,,http://www.iowaheritage.org/files/original/ba93efb1997ac650625bd2f764304e5b.jpg,"Remote Item","C. L. Barnhouse Company",1,0
41521,http://www.iowaheritage.org/items/show/41521,"Atlas and Directory of Rural Taxpayers of Linn County, Iowa","United States|Iowa|Linn County|1910-1920||||","(Wingert & Leefers Publishing Co., 1914, Atlas and Directory of Rural Taxpayers of Linn County, Iowa)",,,"Wingert & Leefers Publishing Co.|State Historical Society of Iowa (Iowa City);",1914|2011-09-19,,"No commercial reproduction or distribution of this file is permitted without permission.","Iowa Counties Historic Atlases;","1 atlas: b&w.; 29 X 39 cm.",English,"Still image; Text;|Plats (Maps); Maps; Title pages; World maps; Indexes; Histories; County seats; Census records; Advertisements;|jp2;",168474626|https://digital.lib.uiowa.edu/,,,,,,,,,,,,,,,,,,,,,,,,,,,,,,,,,,,,,,,,,,,,,,,,"<a href=""https://digital.lib.uiowa.edu/"" target=""_blank"">View this item in its source respository</a>",,,,,,,,,,,,,,,,,,,,,,,,,,,,,http://www.iowaheritage.org/files/original/0b8bfe9e2ae2c31046b8af640bfaf431.jpg,"Remote Item","Iowa Counties Historic Atlases",1,0
41601,http://www.iowaheritage.org/items/show/41601,"Atlas and Farm Directory of Clayton County, Iowa","United States|Iowa|Clayton County|1910-1920|","(Webb Publishing Co., 1914, Atlas and Farm Directory of Clayton County, Iowa)",,,"Webb Publishing Co.;|State Historical Society of Iowa (Iowa City)",1914|2012-02-15,,"No commercial reproduction or distribution of this file is permitted without permission.","Iowa Counties Historic Atlases","1 atlas: b&w.; 31 X 41 cm.",English,"Text; Still image;|Plats (Maps); Title pages; Indexes; World maps; Portraits; Directories; Census records; Advertisements;|jp2;",168474626|https://digital.lib.uiowa.edu/,,,,,,,,,,,,,,,,,,,,,,,,,,,,,,,,,,,,,,,,,,,,,,,,"<a href=""https://digital.lib.uiowa.edu/"" target=""_blank"">View this item in its source respository</a>",,,,,,,,,,,,,,,,,,,,,,,,,,,,,http://www.iowaheritage.org/files/original/13f7308019d69b0a4f3f870b76a7bf8f.jpg,"Remote Item","Iowa Counties Historic Atlases",1,0
41553,http://www.iowaheritage.org/items/show/41553,"Atlas and Farm Directory with Complete Survey in Township Plats of Plymouth County, Iowa","United States|Iowa|Plymouth County|1910-1920||||","(LeMars Sentinel, 1914, Atlas and Farm Directory with Complete Survey in Township Plats of Plymouth County, Iowa)",,,"LeMars Sentinel|State Historical Society of Iowa (Iowa City);",1914|2011-11-07,,"No commercial reproduction or distribution of this file is permitted without permission.","Iowa Counties Historic Atlases;","1 atlas: b&w.; 31 X 40 cm.",English,"Still image; Text;|Plats (Maps); Title pages; Indexes;|jp2;",168474626|https://digital.lib.uiowa.edu/,,,,,,,,,,,,,,,,,,,,,,,,,,,,,,,,,,,,,,,,,,,,,,,,"<a href=""https://digital.lib.uiowa.edu/"" target=""_blank"">View this item in its source respository</a>",,,,,,,,,,,,,,,,,,,,,,,,,,,,,http://www.iowaheritage.org/files/original/1c5411f73c04766482efeaa531b22a95.jpg,"Remote Item","Iowa Counties Historic Atlases",1,0
