 




﻿"Item Id","Item URI","Dublin Core:Title","Dublin Core:Subject","Dublin Core:Description","Dublin Core:Creator","Dublin Core:Source","Dublin Core:Publisher","Dublin Core:Date","Dublin Core:Contributor","Dublin Core:Rights","Dublin Core:Relation","Dublin Core:Format","Dublin Core:Language","Dublin Core:Type","Dublin Core:Identifier","Dublin Core:Coverage","Item Type Metadata:Text","Item Type Metadata:Interviewer","Item Type Metadata:Interviewee","Item Type Metadata:Location","Item Type Metadata:Transcription","Item Type Metadata:Local URL","Item Type Metadata:Original Format","Item Type Metadata:Physical Dimensions","Item Type Metadata:Duration","Item Type Metadata:Compression","Item Type Metadata:Producer","Item Type Metadata:Director","Item Type Metadata:Bit Rate/Frequency","Item Type Metadata:Time Summary","Item Type Metadata:Email Body","Item Type Metadata:Subject Line","Item Type Metadata:From","Item Type Metadata:To","Item Type Metadata:CC","Item Type Metadata:BCC","Item Type Metadata:Number of Attachments","Item Type Metadata:Standards","Item Type Metadata:Objectives","Item Type Metadata:Materials","Item Type Metadata:Lesson Plan Text","Item Type Metadata:URL","Item Type Metadata:Event Type","Item Type Metadata:Participants","Item Type Metadata:Birth Date","Item Type Metadata:Birthplace","Item Type Metadata:Death Date","Item Type Metadata:Occupation","Item Type Metadata:Biographical Text","Item Type Metadata:Bibliography","Item Type Metadata:Digital Reproduction Information","Item Type Metadata:Repository","Item Type Metadata:Repository Collection","Item Type Metadata:Contact information.","Item Type Metadata:File Name","Item Type Metadata:Notes","Item Type Metadata:Digital item created","Item Type Metadata:Digital item modified","Item Type Metadata:Executive Orders","Item Type Metadata:Record Created","Item Type Metadata:Record Modified","Item Type Metadata:Transcription2","Item Type Metadata:Source URL","Omeka Legacy File:Additional Creator","Omeka Legacy File:Transcriber","Omeka Legacy File:Producer","Omeka Legacy File:Render Device","Omeka Legacy File:Render Details","Omeka Legacy File:Capture Date","Omeka Legacy File:Capture Device","Omeka Legacy File:Capture Details","Omeka Legacy File:Change History","Omeka Legacy File:Watermark","Omeka Legacy File:Encryption","Omeka Legacy File:Compression","Omeka Legacy File:Post Processing","Omeka Image File:Width","Omeka Image File:Height","Omeka Image File:Bit Depth","Omeka Image File:Channels","Omeka Image File:Exif String","Omeka Image File:Exif Array","Omeka Image File:IPTC String","Omeka Image File:IPTC Array","Omeka Video File:Bitrate","Omeka Video File:Duration","Omeka Video File:Sample Rate","Omeka Video File:Codec","Omeka Video File:Width","Omeka Video File:Height",tags,file,itemType,collection,public,featured
2218,http://www.iowaheritage.org/items/show/2218,"Drake Relays, 1964, Jyl Wilkie","Track athletics--Iowa--Des Moines|Queens--Drake Relays","Jyl Wilkie from Bradley University, 1964 Relays Queen, with her parents and a Marine.","Clinton, John D.","Special Collections, Cowles Library -- Drake University.",,1964,,"U.S. and International copyright laws protect this digital image. Commercial use or distribution of the image is not permitted without prior permission of the copyright holder. For permission to use the digital image, please contact: bart.schmidt@drake.edu","Drake Relays Digital Archive","35 mm color slide",,Image,"dr00141|http://ddr.lib.drake.edu/u?/du-relays,319",,,,,,,,,,,,,,,,,,,,,,,,,,,,,,,,,,,,,,,,,,,,,,,,"<a href=""http://ddr.lib.drake.edu/u?/du-relays,319"" target=""_blank"">View this item in its source respository</a>",,,,,,,,,,,,,,,,,,,,,,,,,,,,,http://www.iowaheritage.org/files/original/650beab5cf419dd6a716665efe4120cd.jpg,"Remote Item","Drake Relays Digital Archive",1,0
2219,http://www.iowaheritage.org/items/show/2219,"Drake Relays, 1964, Jyl Wilkie","Track athletics--Iowa--Des Moines|Queens--Drake Relays|Athletes--Missouri","Queen Jyl Wilkie of Bradley University stands with the winners of the Quarter Mile Relay from Lincoln University of Missouri.","Clinton, John D.","Special Collections, Cowles Library -- Drake University.",,1964,,"U.S. and International copyright laws protect this digital image. Commercial use or distribution of the image is not permitted without prior permission of the copyright holder. For permission to use the digital image, please contact: bart.schmidt@drake.edu","Drake Relays Digital Archive","35 mm color slide",,Image,"dr00145|http://ddr.lib.drake.edu/u?/du-relays,320",,,,,,,,,,,,,,,,,,,,,,,,,,,,,,,,,,,,,,,,,,,,,,,,"<a href=""http://ddr.lib.drake.edu/u?/du-relays,320"" target=""_blank"">View this item in its source respository</a>",,,,,,,,,,,,,,,,,,,,,,,,,,,,,http://www.iowaheritage.org/files/original/06a15c96e403165031d8e91ae17593bc.jpg,"Remote Item","Drake Relays Digital Archive",1,0
2059,http://www.iowaheritage.org/items/show/2059,"Drake Relays, 1968, Christine Sheets","Track athletics--Iowa--Des Moines|Queens--Drake Relays|Athletes--Kansas","Christine Sheets of Oklahoma State, the 1968 Relays Queen congratulates members of the University of Kansas' distance medley relay team. Standing next to the Queen is Jim Ryun.","Clinton, John D.","Special Collections, Cowles Library -- Drake University.",,1968,,"U.S. and International copyright laws protect this digital image. Commercial use or distribution of the image is not permitted without prior permission of the copyright holder. For permission to use the digital image, please contact: bart.schmidt@drake.edu","Drake Relays Digital Archive","35 mm color slide",,Image,"dr00179|http://ddr.lib.drake.edu/u?/du-relays,113",,,,,,,,,,,,,,,,,,,,,,,,,,,,,,,,,,,,,,,,,,,,,,,,"<a href=""http://ddr.lib.drake.edu/u?/du-relays,113"" target=""_blank"">View this item in its source respository</a>",,,,,,,,,,,,,,,,,,,,,,,,,,,,,http://www.iowaheritage.org/files/original/f27b510e9d2b5e981613487658c09372.jpg,"Remote Item","Drake Relays Digital Archive",1,0
2070,http://www.iowaheritage.org/items/show/2070,"Drake Relays, 1971, Yvonne Marie West","Track athletics--Iowa--Des Moines|Queens--Drake Relays","Yvonne Marie West of Western Illinois University, 1971 Relays Queen, with a Relays official.","Clinton, John D.","Special Collections, Cowles Library -- Drake University.",,1971,,"U.S. and International copyright laws protect this digital image. Commercial use or distribution of the image is not permitted without prior permission of the copyright holder. For permission to use the digital image, please contact: bart.schmidt@drake.edu","Drake Relays Digital Archive","35 mm color slide",,Image,"dr00194|http://ddr.lib.drake.edu/u?/du-relays,124",,,,,,,,,,,,,,,,,,,,,,,,,,,,,,,,,,,,,,,,,,,,,,,,"<a href=""http://ddr.lib.drake.edu/u?/du-relays,124"" target=""_blank"">View this item in its source respository</a>",,,,,,,,,,,,,,,,,,,,,,,,,,,,,http://www.iowaheritage.org/files/original/1d972a24d08df8e6b9d276152bbc89e8.jpg,"Remote Item","Drake Relays Digital Archive",1,0
2431,http://www.iowaheritage.org/items/show/2431,"Drake Relays, 1971, Yvonne Marie West","Track athletics--Iowa--Des Moines|Queens--Drake Relays","Yvonne Marie West of Western Illinois University, 1971 Relays Queen.","Clinton, John D.","Special Collections, Cowles Library -- Drake University.",,1971,,"U.S. and International copyright laws protect this digital image. Commercial use or distribution of the image is not permitted without prior permission of the copyright holder. For permission to use the digital image, please contact: bart.schmidt@drake.edu","Drake Relays Digital Archive","35 mm color slide",,Image,"dr00193|http://ddr.lib.drake.edu/u?/du-relays,642",,,,,,,,,,,,,,,,,,,,,,,,,,,,,,,,,,,,,,,,,,,,,,,,"<a href=""http://ddr.lib.drake.edu/u?/du-relays,642"" target=""_blank"">View this item in its source respository</a>",,,,,,,,,,,,,,,,,,,,,,,,,,,,,http://www.iowaheritage.org/files/original/ffb06c3ed0dad108f68a31b3e77b4a4a.jpg,"Remote Item","Drake Relays Digital Archive",1,0
2121,http://www.iowaheritage.org/items/show/2121,"Drake Relays, 1973, Jennifer Jo Ownes","Track athletics--Iowa--Des Moines|Queens--Drake Relays|Rites & ceremonies--Iowa--Des Moines","Jennifer Jo Ownes of Iowa State University, the 1973 Relays Queen, is crowned by Drake President Wilbur C. Miller.","Clinton, John D.","Special Collections, Cowles Library -- Drake University.",,1973,,"U.S. and International copyright laws protect this digital image. Commercial use or distribution of the image is not permitted without prior permission of the copyright holder. For permission to use the digital image, please contact: bart.schmidt@drake.edu","Drake Relays Digital Archive","35 mm color slide",,Image,"dr00272|http://ddr.lib.drake.edu/u?/du-relays,186",,,,,,,,,,,,,,,,,,,,,,,,,,,,,,,,,,,,,,,,,,,,,,,,"<a href=""http://ddr.lib.drake.edu/u?/du-relays,186"" target=""_blank"">View this item in its source respository</a>",,,,,,,,,,,,,,,,,,,,,,,,,,,,,http://www.iowaheritage.org/files/original/a85916fb73feb570bd4aee0c5f6ddbe5.jpg,"Remote Item","Drake Relays Digital Archive",1,0
2214,http://www.iowaheritage.org/items/show/2214,"Drake Relays, 1974, Brenda Webb","Track athletics--Iowa--Des Moines|Queens--Drake Relays|Athletes--Ohio","Brenda Webb receives an award and a handshake from Relays Queen Gloria Jean Watson (Wichita State). Webb won the Invitational Mile Run with a time of 5:00.2.","Clinton, John D.","Special Collections, Cowles Library -- Drake University.",,1974,,"U.S. and International copyright laws protect this digital image. Commercial use or distribution of the image is not permitted without prior permission of the copyright holder. For permission to use the digital image, please contact: bart.schmidt@drake.edu","Drake Relays Digital Archive","35 mm color slide",,Image,"dr00425|http://ddr.lib.drake.edu/u?/du-relays,309",,,,,,,,,,,,,,,,,,,,,,,,,,,,,,,,,,,,,,,,,,,,,,,,"<a href=""http://ddr.lib.drake.edu/u?/du-relays,309"" target=""_blank"">View this item in its source respository</a>",,,,,,,,,,,,,,,,,,,,,,,,,,,,,http://www.iowaheritage.org/files/original/1cc35758b402259e763e8ee49fd1c68f.jpg,"Remote Item","Drake Relays Digital Archive",1,0
2115,http://www.iowaheritage.org/items/show/2115,"Drake Relays, 1974, Ronald Reagan","Track athletics--Iowa--Des Moines|Governors--California|Governors--Iowa|Queens--Drake Relays","Then California governor Ronald Reagan and Iowa Governor Robert D. Ray pose with the 1974 Drake Relays Queen Gloria Watson.","Clinton, John D.","Special Collections, Cowles Library -- Drake University.",,1974,,"U.S. and International copyright laws protect this digital image. Commercial use or distribution of the image is not permitted without prior permission of the copyright holder. For permission to use the digital image, please contact: bart.schmidt@drake.edu","Drake Relays Digital Archive","35 mm color slide",,Image,"dr00264|http://ddr.lib.drake.edu/u?/du-relays,179",,,,,,,,,,,,,,,,,,,,,,,,,,,,,,,,,,,,,,,,,,,,,,,,"<a href=""http://ddr.lib.drake.edu/u?/du-relays,179"" target=""_blank"">View this item in its source respository</a>",,,,,,,,,,,,,,,,,,,,,,,,,,,,,http://www.iowaheritage.org/files/original/cd8ccccd844ffb28da80cb7f080a8a7d.jpg,"Remote Item","Drake Relays Digital Archive",1,0
6717,http://www.iowaheritage.org/items/show/6717,"Drake Times-Delphic, 1938, Highlights of the Drake Relays Carnival","Track athletics--Iowa--Des Moines|Queens--Drake Relays","Drake Times-Delphic articles about friends and family accompanying Relays Queen Marjory Zechiel and a preview of the 1938 Drake Relays.",,"Special Collections, Cowles Library -- Drake University.",,1938,,"U.S. and International copyright laws protect this digital image. Commercial use or distribution of the image is not permitted without prior permission of the copyright holder. For permission to use the digital image, please contact: bart.schmidt@drake.edu","Drake Relays Digital Archive","Four column newspaper article",,Article,"Drake Times-Delphic, 1938, April 29, Pg. 1|td036|http://ddr.lib.drake.edu/u?/du-relays,719",,,,,,,,,,,,,,,,,,,,,,,,,,,,,,,,,,,,,,,,,,,,,,,,"<a href=""http://ddr.lib.drake.edu/u?/du-relays,719"" target=""_blank"">View this item in its source respository</a>",,,,,,,,,,,,,,,,,,,,,,,,,,,,,http://www.iowaheritage.org/files/original/2b63bf951d495dc58a4aed454f4ced60.jpg,"Remote Item","Drake Relays Digital Archive",1,0
2365,http://www.iowaheritage.org/items/show/2365,"Drake Times-Delphic, 1938, Queen Candidates All Seek Marriage","Track athletics--Iowa--Des Moines|Queens--Drake Relays","A Drake Times-Delphic article describes  the candidates for the 1938 Drake Relays Queen.",,"Special Collections, Cowles Library -- Drake University.",,,,"U.S. and International copyright laws protect this digital image. Commercial use or distribution of the image is not permitted without prior permission of the copyright holder. For permission to use the digital image, please contact: bart.schmidt@drake.edu","Drake Relays Digital Archive","Four column newspaper article",,Article,"Drake Times-Delphic, 1938,  April 22, Pg. 3|td033|http://ddr.lib.drake.edu/u?/du-relays,556",,,,,,,,,,,,,,,,,,,,,,,,,,,,,,,,,,,,,,,,,,,,,,,,"<a href=""http://ddr.lib.drake.edu/u?/du-relays,556"" target=""_blank"">View this item in its source respository</a>",,,,,,,,,,,,,,,,,,,,,,,,,,,,,http://www.iowaheritage.org/files/original/e1d324e60cf0da20fe7846ac15204fb1.jpg,"Remote Item","Drake Relays Digital Archive",1,0
