 




﻿"Item Id","Item URI","Dublin Core:Title","Dublin Core:Subject","Dublin Core:Description","Dublin Core:Creator","Dublin Core:Source","Dublin Core:Publisher","Dublin Core:Date","Dublin Core:Contributor","Dublin Core:Rights","Dublin Core:Relation","Dublin Core:Format","Dublin Core:Language","Dublin Core:Type","Dublin Core:Identifier","Dublin Core:Coverage","Item Type Metadata:Text","Item Type Metadata:Interviewer","Item Type Metadata:Interviewee","Item Type Metadata:Location","Item Type Metadata:Transcription","Item Type Metadata:Local URL","Item Type Metadata:Original Format","Item Type Metadata:Physical Dimensions","Item Type Metadata:Duration","Item Type Metadata:Compression","Item Type Metadata:Producer","Item Type Metadata:Director","Item Type Metadata:Bit Rate/Frequency","Item Type Metadata:Time Summary","Item Type Metadata:Email Body","Item Type Metadata:Subject Line","Item Type Metadata:From","Item Type Metadata:To","Item Type Metadata:CC","Item Type Metadata:BCC","Item Type Metadata:Number of Attachments","Item Type Metadata:Standards","Item Type Metadata:Objectives","Item Type Metadata:Materials","Item Type Metadata:Lesson Plan Text","Item Type Metadata:URL","Item Type Metadata:Event Type","Item Type Metadata:Participants","Item Type Metadata:Birth Date","Item Type Metadata:Birthplace","Item Type Metadata:Death Date","Item Type Metadata:Occupation","Item Type Metadata:Biographical Text","Item Type Metadata:Bibliography","Item Type Metadata:Digital Reproduction Information","Item Type Metadata:Repository","Item Type Metadata:Repository Collection","Item Type Metadata:Contact information.","Item Type Metadata:File Name","Item Type Metadata:Notes","Item Type Metadata:Digital item created","Item Type Metadata:Digital item modified","Item Type Metadata:Executive Orders","Item Type Metadata:Record Created","Item Type Metadata:Record Modified","Item Type Metadata:Transcription2","Item Type Metadata:Source URL","Omeka Legacy File:Additional Creator","Omeka Legacy File:Transcriber","Omeka Legacy File:Producer","Omeka Legacy File:Render Device","Omeka Legacy File:Render Details","Omeka Legacy File:Capture Date","Omeka Legacy File:Capture Device","Omeka Legacy File:Capture Details","Omeka Legacy File:Change History","Omeka Legacy File:Watermark","Omeka Legacy File:Encryption","Omeka Legacy File:Compression","Omeka Legacy File:Post Processing","Omeka Image File:Width","Omeka Image File:Height","Omeka Image File:Bit Depth","Omeka Image File:Channels","Omeka Image File:Exif String","Omeka Image File:Exif Array","Omeka Image File:IPTC String","Omeka Image File:IPTC Array","Omeka Video File:Bitrate","Omeka Video File:Duration","Omeka Video File:Sample Rate","Omeka Video File:Codec","Omeka Video File:Width","Omeka Video File:Height",tags,file,itemType,collection,public,featured
22577,http://www.iowaheritage.org/items/show/22577,"People dining on balcony of Iowa Memorial Union, The University of Iowa, 1930s?","Balconies|University of Iowa|United States -- Iowa -- Iowa City|1930-1940|Umbrellas|Eating & drinking|Universities & colleges|Iowa Memorial Union (Iowa City, Iowa)",,"Kent, Frederick W. (Frederick Wallace), 1894-1984",,"The University of Iowa. Libraries. University Archives",1930/1939|2008-05,,"Educational use only, no other permissions given. U.S. and international copyright laws may protect this digital object. Commercial use or distribution of the object is not permitted without prior permission of the copyright holder.","Iowa City Town and Campus Scenes|Frederick W. Kent collection of photographs, 1866-2000|http://www.lib.uiowa.edu/collguides/?RG30.0001.01|Prints|Events and activities|Convocation|Convocation|Scanned with Ricoh Aficio 3228C at 600 ppi, full color. Master images saved in tiff format.",12|17,,"Still image|Photographs|jpeg",RG30.0001.01|ea0227.jpg|https://digital.lib.uiowa.edu/,,,,,,,,,,,,,,,,,,,,,,,,,,,,,,,,,,,,,,,,,,,,,,,,"<a href=""https://digital.lib.uiowa.edu/"" target=""_blank"">View this item in its source respository</a>",,,,,,,,,,,,,,,,,,,,,,,,,,,,,http://www.iowaheritage.org/files/original/dbaa44fe537446d685c33d741572df74.jpg,"Remote Item","Iowa City Town and Campus Scenes",1,0
22578,http://www.iowaheritage.org/items/show/22578,"Orchestra concert at Iowa Memorial Union, The University of Iowa, 1930s?","Orchestras|University of Iowa|United States -- Iowa -- Iowa City|1930-1940|Concerts|Universities & colleges|Iowa Memorial Union (Iowa City, Iowa)",,"Kent, Frederick W. (Frederick Wallace), 1894-1984",,"The University of Iowa. Libraries. University Archives",1930/1939|2008-05,,"Educational use only, no other permissions given. U.S. and international copyright laws may protect this digital object. Commercial use or distribution of the object is not permitted without prior permission of the copyright holder.","Iowa City Town and Campus Scenes|Frederick W. Kent collection of photographs, 1866-2000|http://www.lib.uiowa.edu/collguides/?RG30.0001.01|Prints|Events and activities|Convocation|Convocation|Scanned with Ricoh Aficio 3228C at 600 ppi, full color. Master images saved in tiff format.",11|17,,"Still image|Photographs|jpeg",RG30.0001.01|ea0228.jpg|https://digital.lib.uiowa.edu/,,,,,,,,,,,,,,,,,,,,,,,,,,,,,,,,,,,,,,,,,,,,,,,,"<a href=""https://digital.lib.uiowa.edu/"" target=""_blank"">View this item in its source respository</a>",,,,,,,,,,,,,,,,,,,,,,,,,,,,,http://www.iowaheritage.org/files/original/d33b0a950f25868e28e4f8ff1e8ccd22.jpg,"Remote Item","Iowa City Town and Campus Scenes",1,0
22979,http://www.iowaheritage.org/items/show/22979,"Midyear commencement at the Iowa Memorial Union, The University of Iowa, 1931","Graduation ceremonies|Academic costume|University of Iowa|United States -- Iowa -- Iowa City|1930-1940|Alumni & alumnae|Crowds|Universities & colleges|Iowa Memorial Union (Iowa City, Iowa)",,"Kent, Frederick W. (Frederick Wallace), 1894-1984",,"The University of Iowa. Libraries. University Archives",1931,,"Educational use only, no other permissions given. U.S. and international copyright laws may protect this digital object. Commercial use or distribution of the object is not permitted without prior permission of the copyright holder.","Iowa City Town and Campus Scenes|Frederick W. Kent collection of photographs, 1866-2000|http://www.lib.uiowa.edu/collguides/?RG30.0001.01|Prints|Events and activities|Commencement|Commencement|Scanned with Ricoh Aficio 3228C at 600 ppi, full color. Master images saved in tiff format.",13|18,,"Still image|Photographs|jpeg",RG30.0001.01|https://digital.lib.uiowa.edu/,,,,,,,,,,,,,,,,,,,,,,,,,,,,,,,,,,,,,,,,,,,,,,,,"<a href=""https://digital.lib.uiowa.edu/"" target=""_blank"">View this item in its source respository</a>",,,,,,,,,,,,,,,,,,,,,,,,,,,,,http://www.iowaheritage.org/files/original/105f5f5ba153242d8b3204bfdbb9b1b0.jpg,"Remote Item","Iowa City Town and Campus Scenes",1,0
23060,http://www.iowaheritage.org/items/show/23060,"Women's drill team, Iowa Field, The University of Iowa, 1928","Universities & colleges|University of Iowa|United States -- Iowa -- Iowa City|1920-1930|Drill teams|May poles|Iowa Field (Iowa City, Iowa)|Iowa Memorial Union (Iowa City, Iowa)",,"Kent, Frederick W. (Frederick Wallace), 1894-1984",,"University of Iowa. Libraries. University Archives",1928|2008-05,,"Educational use only, no other permissions given. U.S. and international copyright laws may protect this digital object. Commercial use or distribution of the object is not permitted without prior permission of the copyright holder.","Iowa City Town and Campus Scenes|Frederick W. Kent Collection of Photographs, 1866-2000|http://www.lib.uiowa.edu/collguides/?RG30.0001.01|Prints|Events and activities|Fetes|Fetes|Scanned with Ricoh Aficio 3228C @ 600 ppi, full color. Master image saved in TIFF format.",9|14,,"Still image|Photographs; Postcards|jpeg",RG30.0001.01|https://digital.lib.uiowa.edu/,,,,,,,,,,,,,,,,,,,,,,,,,,,,,,,,,,,,,,,,,,,,,,,,"<a href=""https://digital.lib.uiowa.edu/"" target=""_blank"">View this item in its source respository</a>",,,,,,,,,,,,,,,,,,,,,,,,,,,,,http://www.iowaheritage.org/files/original/dc0b32311b291aeaf92f018f40a50fb3.jpg,"Remote Item","Iowa City Town and Campus Scenes",1,0
23234,http://www.iowaheritage.org/items/show/23234,"Student registration at Iowa Memorial Union, The University of Iowa, 1930s","Universities & colleges|University of Iowa|United States -- Iowa -- Iowa City|1930-1940|Recording & registration|Students|Iowa Memorial Union (Iowa City, Iowa)",,"Kent, Frederick W. (Frederick Wallace), 1894-1984",,"University of Iowa. Libraries. University Archives",1930/1939|2008-05,,"Educational use only, no other permissions given. U.S. and international copyright laws may protect this digital object. Commercial use or distribution of the object is not permitted without prior permission of the copyright holder.","Iowa City Town and Campus Scenes|Frederick W. Kent Collection of Photographs, 1866-2000|http://www.lib.uiowa.edu/collguides/?RG30.0001.01|Prints|Events and activities|Freshman week|Freshman week|Scanned with Ricoh Aficio 3228C @ 600 ppi, full color. Master image saved in TIFF format.",9|10,,"Still image|Photographs|jpeg",RG30.0001.01|https://digital.lib.uiowa.edu/,,,,,,,,,,,,,,,,,,,,,,,,,,,,,,,,,,,,,,,,,,,,,,,,"<a href=""https://digital.lib.uiowa.edu/"" target=""_blank"">View this item in its source respository</a>",,,,,,,,,,,,,,,,,,,,,,,,,,,,,http://www.iowaheritage.org/files/original/d0936dc53fc5034e80c71254dccb8587.jpg,"Remote Item","Iowa City Town and Campus Scenes",1,0
23419,http://www.iowaheritage.org/items/show/23419,"Iowa-Cambridge debate in Main Lounge of Iowa Memorial Union, The University of Iowa, October 24, 1927","Audiences|University of Iowa|United States -- Iowa -- Iowa City|1920-1930|Scoreboards|Debates|Universities & colleges|Iowa Memorial Union (Iowa City, Iowa)|University of Cambridge",,"Kent, Frederick W. (Frederick Wallace), 1894-1984",,"University of Iowa. Libraries. University Archives",1927-10-24|2008-05,,"Educational use only, no other permissions given. U.S. and international copyright laws may protect this digital object. Commercial use or distribution of the object is not permitted without prior permission of the copyright holder.","Iowa City Town and Campus Scenes|Frederick W. Kent Collection of Photographs, 1866-2000|http://www.lib.uiowa.edu/collguides/?RG30.0001.01|Prints|Scanned with Ricoh Aficio 3228C at 600 ppi, full color. Master images saved in tiff format.",12|16,,"Still image|Photographs|jpeg",RG30.0001.01|https://digital.lib.uiowa.edu/,,,,,,,,,,,,,,,,,,,,,,,,,,,,,,,,,,,,,,,,,,,,,,,,"<a href=""https://digital.lib.uiowa.edu/"" target=""_blank"">View this item in its source respository</a>",,,,,,,,,,,,,,,,,,,,,,,,,,,,,http://www.iowaheritage.org/files/original/e35ea31dac6fcc65758427451f4ea25a.jpg,"Remote Item","Iowa City Town and Campus Scenes",1,0
23775,http://www.iowaheritage.org/items/show/23775,"Music ensemble Homecoming dance, Iowa Memorial Union, The University of Iowa, October 7, 1950","Universities & colleges|University of Iowa|United States -- Iowa -- Iowa City|1950-1960|Music ensembles|Saxophones|Orchestras|Iowa Memorial Union (Iowa City, Iowa)",,"Kent, Frederick W. (Frederick Wallace), 1894-1984",,,1950-10-07,,"Educational use only, no other permissions given. U.S. and international copyright laws may protect this digital object. Commercial use or distribution of the object is not permitted without prior permission of the copyright holder.","Iowa City Town and Campus Scenes|Frederick W. Kent Collection of Photographs, 1866-2000|http://www.lib.uiowa.edu/collguides/?RG30.0001.01|Prints|Events and activities|Homecoming|Homecoming|Scanned with Ricoh Aficio 3228C at 600 ppi, full color. Master images saved in tiff format.",21|25,,"Still image|Photographs",RG30.0001.01|https://digital.lib.uiowa.edu/,,,,,,,,,,,,,,,,,,,,,,,,,,,,,,,,,,,,,,,,,,,,,,,,"<a href=""https://digital.lib.uiowa.edu/"" target=""_blank"">View this item in its source respository</a>",,,,,,,,,,,,,,,,,,,,,,,,,,,,,http://www.iowaheritage.org/files/original/f9fb5cecac3e08096855b426c0cefa39.jpg,"Remote Item","Iowa City Town and Campus Scenes",1,0
23805,http://www.iowaheritage.org/items/show/23805,"Homecoming crowd at Iowa Memorial Union, The University of Iowa, 1940s","Universities & colleges|University of Iowa|United States -- Iowa -- Iowa City|1940-1950|Crowds|Iowa Memorial Union (Iowa City, Iowa)","Part of Homecoming activities.","Kent, Frederick W. (Frederick Wallace), 1894-1984",,"University of Iowa. Libraries. University Archives",1940/1949|2008-05,,"Educational use only, no other permissions given. U.S. and international copyright laws may protect this digital object. Commercial use or distribution of the object is not permitted without prior permission of the copyright holder.","Iowa City Town and Campus Scenes|Frederick W. Kent Collection of Photographs, 1866-2000|http://www.lib.uiowa.edu/collguides/?RG30.0001.01|Prints|Events and activities|Homecoming|Homecoming|Scanned with Ricoh Aficio 3228C @ 600 ppi, full color. Master image saved in TIFF format.",,,"Still image|Photographs|jpeg",RG30.0001.01|ea0715.jpg|https://digital.lib.uiowa.edu/,,,,,,,,,,,,,,,,,,,,,,,,,,,,,,,,,,,,,,,,,,,,,,,,"<a href=""https://digital.lib.uiowa.edu/"" target=""_blank"">View this item in its source respository</a>",,,,,,,,,,,,,,,,,,,,,,,,,,,,,http://www.iowaheritage.org/files/original/14452c4732a8f0c48df7340bfd9a1119.jpg,"Remote Item","Iowa City Town and Campus Scenes",1,0
23852,http://www.iowaheritage.org/items/show/23852,"Christmas party at Iowa Memorial Union, The University of Iowa, 1920s","Universities & colleges|Santa Claus|University of Iowa|United States -- Iowa -- Iowa City|1920-1930|Parties|Christmas trees|Iowa Memorial Union (Iowa City, Iowa)",,"Kent, Frederick W. (Frederick Wallace), 1894-1984",,"University of Iowa. Libraries. University Archives",1920/1929,,"Educational use only, no other permissions given. U.S. and international copyright laws may protect this digital object. Commercial use or distribution of the object is not permitted without prior permission of the copyright holder.","Iowa City Town and Campus Scenes|Frederick W. Kent Collection of Photographs, 1866-2000|http://www.lib.uiowa.edu/collguides/?RG30.0001.01|Prints|Events and activities|Parties and dances|Parties and dances",,,"Still image|Photographs|jpeg",RG30.0001.01|ea0749.jpg|https://digital.lib.uiowa.edu/,,,,,,,,,,,,,,,,,,,,,,,,,,,,,,,,,,,,,,,,,,,,,,,,"<a href=""https://digital.lib.uiowa.edu/"" target=""_blank"">View this item in its source respository</a>",,,,,,,,,,,,,,,,,,,,,,,,,,,,,http://www.iowaheritage.org/files/original/64cb5ecf5e3072a791300fa184585121.jpg,"Remote Item","Iowa City Town and Campus Scenes",1,0
24073,http://www.iowaheritage.org/items/show/24073,"CBS-TV film crew shooting a scene in the Iowa Memorial Union, The University of Iowa, June 1953","Universities & colleges|Davis, Allan|University of Iowa|United States -- Iowa -- Iowa City|1950-1960|Filmmakers|Microphones|Television programs|Goering, Sonya|Iowa Memorial Union (Iowa City, Iowa)",,"Kent, Frederick W. (Frederick Wallace), 1894-1984",,"University of Iowa. Libraries. University Archives",1953-06|2008-05,,"Educational use only, no other permissions given. U.S. and international copyright laws may protect this digital object. Commercial use or distribution of the object is not permitted without prior permission of the copyright holder.","Iowa City Town and Campus Scenes|Frederick W. Kent Collection of Photographs, 1866-2000|http://www.lib.uiowa.edu/collguides/?RG30.0001.01|Prints|Scanned with Ricoh Aficio 3228C @ 600 ppi, full color. Master image saved in TIFF format.",18|13,,"Still image; Text|Photographs|jpeg",RG30.0001.01|https://digital.lib.uiowa.edu/,,,,,,,,,,,,,,,,,,,,,,,,,,,,,,,,,,,,,,,,,,,,,,,,"<a href=""https://digital.lib.uiowa.edu/"" target=""_blank"">View this item in its source respository</a>",,,,,,,,,,,,,,,,,,,,,,,,,,,,,http://www.iowaheritage.org/files/original/5e6bb7efbc383631a2d89464b609fc13.jpg,"Remote Item","Iowa City Town and Campus Scenes",1,0
