 




﻿"Item Id","Item URI","Dublin Core:Title","Dublin Core:Subject","Dublin Core:Description","Dublin Core:Creator","Dublin Core:Source","Dublin Core:Publisher","Dublin Core:Date","Dublin Core:Contributor","Dublin Core:Rights","Dublin Core:Relation","Dublin Core:Format","Dublin Core:Language","Dublin Core:Type","Dublin Core:Identifier","Dublin Core:Coverage","Item Type Metadata:Text","Item Type Metadata:Interviewer","Item Type Metadata:Interviewee","Item Type Metadata:Location","Item Type Metadata:Transcription","Item Type Metadata:Local URL","Item Type Metadata:Original Format","Item Type Metadata:Physical Dimensions","Item Type Metadata:Duration","Item Type Metadata:Compression","Item Type Metadata:Producer","Item Type Metadata:Director","Item Type Metadata:Bit Rate/Frequency","Item Type Metadata:Time Summary","Item Type Metadata:Email Body","Item Type Metadata:Subject Line","Item Type Metadata:From","Item Type Metadata:To","Item Type Metadata:CC","Item Type Metadata:BCC","Item Type Metadata:Number of Attachments","Item Type Metadata:Standards","Item Type Metadata:Objectives","Item Type Metadata:Materials","Item Type Metadata:Lesson Plan Text","Item Type Metadata:URL","Item Type Metadata:Event Type","Item Type Metadata:Participants","Item Type Metadata:Birth Date","Item Type Metadata:Birthplace","Item Type Metadata:Death Date","Item Type Metadata:Occupation","Item Type Metadata:Biographical Text","Item Type Metadata:Bibliography","Item Type Metadata:Digital Reproduction Information","Item Type Metadata:Repository","Item Type Metadata:Repository Collection","Item Type Metadata:Contact information.","Item Type Metadata:File Name","Item Type Metadata:Notes","Item Type Metadata:Digital item created","Item Type Metadata:Digital item modified","Item Type Metadata:Executive Orders","Item Type Metadata:Record Created","Item Type Metadata:Record Modified","Item Type Metadata:Transcription2","Item Type Metadata:Source URL","Omeka Legacy File:Additional Creator","Omeka Legacy File:Transcriber","Omeka Legacy File:Producer","Omeka Legacy File:Render Device","Omeka Legacy File:Render Details","Omeka Legacy File:Capture Date","Omeka Legacy File:Capture Device","Omeka Legacy File:Capture Details","Omeka Legacy File:Change History","Omeka Legacy File:Watermark","Omeka Legacy File:Encryption","Omeka Legacy File:Compression","Omeka Legacy File:Post Processing","Omeka Image File:Width","Omeka Image File:Height","Omeka Image File:Bit Depth","Omeka Image File:Channels","Omeka Image File:Exif String","Omeka Image File:Exif Array","Omeka Image File:IPTC String","Omeka Image File:IPTC Array","Omeka Video File:Bitrate","Omeka Video File:Duration","Omeka Video File:Sample Rate","Omeka Video File:Codec","Omeka Video File:Width","Omeka Video File:Height",tags,file,itemType,collection,public,featured
14089,http://www.iowaheritage.org/items/show/14089,"Hastings, Iowa. BN","Railroad stations|Burlington Northern Railroad Company|United States -- Iowa -- Mills County -- Hastings|1980-1990|Grain elevators|Railroad cars","Sign for Hastings next to tracks.  Train cars and grain elevator in background. ""View looks W. Ron Sims photo, 2717 Cornell, D.M. IA 50313""--Photograph verso.","Sims, Ronald D.",,"University of Iowa. Libraries. Special Collections Dept.",1988-10-12|2006-02-27,,"Educational use only, no other permissions given. U.S. and international copyright laws may protect this digital image. Commercial use or distribution of the image is not permitted without prior permission of the copyright holder. For information see:  http://www.lib.uiowa.edu/spec-coll/help/copyright.html","John P. Vander Maas Railroadiana|John P. Vander Maas Railroadiana Collection|MSC0468|http://lib.uiowa.edu/collguides/?MSC0468|Vol. 44, Depots by county",9|13,,"Still image|Photographs|jpeg",44hastings02.jpg|169946290|https://digital.lib.uiowa.edu/,,,,,,,,,,,,,,,,,,,,,,,,,,,,,,,,,,,,,,,,,,,,,,,,"<a href=""https://digital.lib.uiowa.edu/"" target=""_blank"">View this item in its source respository</a>",,,,,,,,,,,,,,,,,,,,,,,,,,,,,http://www.iowaheritage.org/files/original/af67b2a06c554a786a5bf2d9782c92a9.jpg,"Remote Item","John P. Vander Maas Railroadiana",1,0
14085,http://www.iowaheritage.org/items/show/14085,"Malvern, Iowa. BN","Railroad stations|Burlington Northern Railroad Company|United States -- Iowa -- Mills County -- Malvern|1980-1990|Buildings|Railroad cars","Shed.  Railroad cars on tracks and overpass in distance.",unknown,,"University of Iowa. Libraries. Special Collections Dept.",1980-07|2006-02-27,,"Educational use only, no other permissions given. U.S. and international copyright laws may protect this digital image. Commercial use or distribution of the image is not permitted without prior permission of the copyright holder. For information see:  http://www.lib.uiowa.edu/spec-coll/help/copyright.html","John P. Vander Maas Railroadiana|John P. Vander Maas Railroadiana Collection|MSC0468|http://lib.uiowa.edu/collguides/?MSC0468|Vol. 44, Depots by county",8|12,,"Still image|Photographs|jpeg",44malvern02.jpg|169946290|https://digital.lib.uiowa.edu/,,,,,,,,,,,,,,,,,,,,,,,,,,,,,,,,,,,,,,,,,,,,,,,,"<a href=""https://digital.lib.uiowa.edu/"" target=""_blank"">View this item in its source respository</a>",,,,,,,,,,,,,,,,,,,,,,,,,,,,,http://www.iowaheritage.org/files/original/1ac4d3143fe0434c95f726780674b97e.jpg,"Remote Item","John P. Vander Maas Railroadiana",1,0
14084,http://www.iowaheritage.org/items/show/14084,"Emerson, Iowa. BN","Railroad stations|Burlington Northern Railroad Company|United States -- Iowa -- Mills County -- Emerson|1980-1990|Grain elevators","Sign for Emerson and grain elevator with Purina Chows Emerson Farm Supply. ""View looks W.  [Ro]n Sims photo, [27]17 Cornell, [D.]M. IA 50313""--Photograph verso.","Sims, Ronald D.",,"University of Iowa. Libraries. Special Collections Dept.",1987-06-25|2006-02-27,,"Educational use only, no other permissions given. U.S. and international copyright laws may protect this digital image. Commercial use or distribution of the image is not permitted without prior permission of the copyright holder. For information see:  http://www.lib.uiowa.edu/spec-coll/help/copyright.html","John P. Vander Maas Railroadiana|John P. Vander Maas Railroadiana Collection|MSC0468|http://lib.uiowa.edu/collguides/?MSC0468|Vol. 44, Depots by county",8|12,,"Still image|Photographs|jpeg",44emerson02.jpg|169946290|https://digital.lib.uiowa.edu/,,,,,,,,,,,,,,,,,,,,,,,,,,,,,,,,,,,,,,,,,,,,,,,,"<a href=""https://digital.lib.uiowa.edu/"" target=""_blank"">View this item in its source respository</a>",,,,,,,,,,,,,,,,,,,,,,,,,,,,,http://www.iowaheritage.org/files/original/af68a6af45760ba22a6ffde1588b2f95.jpg,"Remote Item","John P. Vander Maas Railroadiana",1,0
13981,http://www.iowaheritage.org/items/show/13981,"Harvey, Iowa. BN","Railroad stations|Burlington Northern Railroad Company|United States -- Iowa -- Marion County -- Harvey|1990-2000","Tracks. ""Looks W. Ron Sims photo, 2717 Cornell, D.M. IA 50313""--Photograph verso.","Sims, Ronald D.",,"University of Iowa. Libraries. Special Collections Dept.",1992-03-13|2006-02-08,,"Educational use only, no other permissions given. U.S. and international copyright laws may protect this digital image. Commercial use or distribution of the image is not permitted without prior permission of the copyright holder. For information see:  http://www.lib.uiowa.edu/spec-coll/help/copyright.html","John P. Vander Maas Railroadiana|John P. Vander Maas Railroadiana Collection|MSC0468|http://lib.uiowa.edu/collguides/?MSC0468|Vol. 44, Depots by county",9|13,,"Still image|Photographs|jpeg",44harvey03.jpg|169946290|https://digital.lib.uiowa.edu/,,,,,,,,,,,,,,,,,,,,,,,,,,,,,,,,,,,,,,,,,,,,,,,,"<a href=""https://digital.lib.uiowa.edu/"" target=""_blank"">View this item in its source respository</a>",,,,,,,,,,,,,,,,,,,,,,,,,,,,,http://www.iowaheritage.org/files/original/934fffa1db4d10f05b1a78bf583e269c.jpg,"Remote Item","John P. Vander Maas Railroadiana",1,0
13980,http://www.iowaheritage.org/items/show/13980,"Knoxville, Iowa. BN","Railroad stations|Burlington Northern Railroad Company|United States -- Iowa -- Marion County -- Knoxville|1990-2000","Sign for Knoxville next to foundation. ""Ron Sims photo, 2717 Cornell, D.M. IA 50313""--Photograph verso.","Sims, Ronald D.",,"The University of Iowa Libraries Special Collections: http://www.lib.uiowa.edu/spec-coll/",1991-04-25|2006-02-08,,"Educational use only, no other permissions given. U.S. and international copyright laws may protect this digital image. Commercial use or distribution of the image is not permitted without prior permission of the copyright holder. For information see:  http://www.lib.uiowa.edu/spec-coll/help/copyright.html","John P. Vander Maas Railroadiana|John P. Vander Maas Railroadiana Collection|MSC0468|http://lib.uiowa.edu/collguides/?MSC0468|Vol. 44, Depots by county",9|13,,"Still image|Photographs|jpeg",44knoxville02.jpg|169946290|https://digital.lib.uiowa.edu/,,,,,,,,,,,,,,,,,,,,,,,,,,,,,,,,,,,,,,,,,,,,,,,,"<a href=""https://digital.lib.uiowa.edu/"" target=""_blank"">View this item in its source respository</a>",,,,,,,,,,,,,,,,,,,,,,,,,,,,,http://www.iowaheritage.org/files/original/a3b693195a5288e0e59946faf960ffba.jpg,"Remote Item","John P. Vander Maas Railroadiana",1,0
13950,http://www.iowaheritage.org/items/show/13950,"Swan, Iowa. BN","Railroad stations|Burlington Northern Railroad Company|United States -- Iowa -- Marion County -- Swan",,unknown,,"University of Iowa. Libraries. Special Collections Dept.",Unknown|2006-02-08,,"Educational use only, no other permissions given. U.S. and international copyright laws may protect this digital image. Commercial use or distribution of the image is not permitted without prior permission of the copyright holder. For information see:  http://www.lib.uiowa.edu/spec-coll/help/copyright.html","John P. Vander Maas Railroadiana|John P. Vander Maas Railroadiana Collection|MSC0468|http://lib.uiowa.edu/collguides/?MSC0468|Vol. 44, Depots by county","1 photograph : b&w ; 9 x 13 cm. + 1 letter : 1 p. ; 8 x 11 cm.",,"Still image|Photographs; Text; Maps.|jpeg",169946290|https://digital.lib.uiowa.edu/,,,,,,,,,,,,,,,,,,,,,,,,,,,,,,,,,,,,,,,,,,,,,,,,"<a href=""https://digital.lib.uiowa.edu/"" target=""_blank"">View this item in its source respository</a>",,,,,,,,,,,,,,,,,,,,,,,,,,,,,http://www.iowaheritage.org/files/original/08f956eb4638bb17c915b166f2806dfe.jpg,"Remote Item","John P. Vander Maas Railroadiana",1,0
13933,http://www.iowaheritage.org/items/show/13933,"Percival, Iowa. BN","Railroad stations|Burlington Northern Railroad Company|United States -- Iowa -- Fremont County -- Percival|1990-2000|Grain elevators|Railroad signals","Sign for Percival on two posts. Grain elevator and railroad crossing signal in background. ""Looks S. Ron Sims photo, 2717 Cornell, DM IA 50313""--Photograph verso.","Sims, Ronald D.",,"University of Iowa. Libraries. Special Collections Dept.",1992-09-19|2006-02-10,,"Educational use only, no other permissions given. U.S. and international copyright laws may protect this digital image. Commercial use or distribution of the image is not permitted without prior permission of the copyright holder. For information see:  http://www.lib.uiowa.edu/spec-coll/help/copyright.html","John P. Vander Maas Railroadiana|John P. Vander Maas Railroadiana Collection|MSC0468|http://lib.uiowa.edu/collguides/?MSC0468|Vol. 42, Depots by county",9|13,,"Still image|Photographs|jpeg",42percival03.jpg|169946290|https://digital.lib.uiowa.edu/,,,,,,,,,,,,,,,,,,,,,,,,,,,,,,,,,,,,,,,,,,,,,,,,"<a href=""https://digital.lib.uiowa.edu/"" target=""_blank"">View this item in its source respository</a>",,,,,,,,,,,,,,,,,,,,,,,,,,,,,http://www.iowaheritage.org/files/original/71c6c7c2ba8dd24cea60a3b17def2ac0.jpg,"Remote Item","John P. Vander Maas Railroadiana",1,0
13932,http://www.iowaheritage.org/items/show/13932,"McPaul, Iowa. BN","Railroad stations|Burlington Northern Railroad Company|United States -- Iowa -- Fremont County -- McPaul|1990-2000|Grain elevators|Railroad cars","Sign for McPaul on two posts. Grain elevator and railroad cars. ""Looks N. Ron Sims photo, 2717 Cornell, DM IA 50313""--Photograph verso.","Sims, Ronald D.",,"University of Iowa. Libraries. Special Collections Dept.",1992-10-19|2006-02-10,,"Educational use only, no other permissions given. U.S. and international copyright laws may protect this digital image. Commercial use or distribution of the image is not permitted without prior permission of the copyright holder. For information see:  http://www.lib.uiowa.edu/spec-coll/help/copyright.html","John P. Vander Maas Railroadiana|John P. Vander Maas Railroadiana Collection|MSC0468|http://lib.uiowa.edu/collguides/?MSC0468|Vol. 42, Depots by county",9|13,,"Still image|Photographs|jpeg",42mcpaul03.jpg|169946290|https://digital.lib.uiowa.edu/,,,,,,,,,,,,,,,,,,,,,,,,,,,,,,,,,,,,,,,,,,,,,,,,"<a href=""https://digital.lib.uiowa.edu/"" target=""_blank"">View this item in its source respository</a>",,,,,,,,,,,,,,,,,,,,,,,,,,,,,http://www.iowaheritage.org/files/original/c6f6f562258105bca7b6160b1995a3e0.jpg,"Remote Item","John P. Vander Maas Railroadiana",1,0
13931,http://www.iowaheritage.org/items/show/13931,"Bartlett, Iowa. BN","Railroad stations|Burlington Northern Railroad Company|United States -- Iowa -- Fremont County -- Bartlett|1990-2000|Buildings|Grain elevators|Railroad cars","Sign for Bartlett on two posts. Grain elevator to  right. Railroad cars sitting on tracks. ""Looks S. Ron Sims photo, 2717 Cornell, DM IA 50313""--Photograph verso.","Sims, Ronald D.",,"University of Iowa. Libraries. Special Collections Dept.",1992-10-19|2006-02-10,,"Educational use only, no other permissions given. U.S. and international copyright laws may protect this digital image. Commercial use or distribution of the image is not permitted without prior permission of the copyright holder. For information see:  http://www.lib.uiowa.edu/spec-coll/help/copyright.html","John P. Vander Maas Railroadiana|John P. Vander Maas Railroadiana Collection|MSC0468|http://lib.uiowa.edu/collguides/?MSC0468|Vol. 42, Depots by county",9|13,,"Still image|Photographs|jpeg",42bartlett02.jpg|169946290|https://digital.lib.uiowa.edu/,,,,,,,,,,,,,,,,,,,,,,,,,,,,,,,,,,,,,,,,,,,,,,,,"<a href=""https://digital.lib.uiowa.edu/"" target=""_blank"">View this item in its source respository</a>",,,,,,,,,,,,,,,,,,,,,,,,,,,,,http://www.iowaheritage.org/files/original/b1a02cd24243f2dfea017c4a0f24ce72.jpg,"Remote Item","John P. Vander Maas Railroadiana",1,0
13930,http://www.iowaheritage.org/items/show/13930,"Hamburg, Iowa. BN","Railroad stations|Burlington Northern Railroad Company|United States -- Iowa -- Fremont County -- Hamburg|1990-2000|Railroad cars","Sign for Hamburg on two posts. Railroad cars in background. ""Looks N. Ron Sims photo, 2717 Cornell, D.M. IA 50313""--Photograph verso.","Sims, Ronald D.",,"University of Iowa. Libraries. Special Collections Dept.",1992-10-20|2006-02-09,,"Educational use only, no other permissions given. U.S. and international copyright laws may protect this digital image. Commercial use or distribution of the image is not permitted without prior permission of the copyright holder. For information see:  http://www.lib.uiowa.edu/spec-coll/help/copyright.html","John P. Vander Maas Railroadiana|John P. Vander Maas Railroadiana Collection|MSC0468|http://lib.uiowa.edu/collguides/?MSC0468|Vol. 42, Depots by county",9|13,,"Still image|Photographs|jpeg",42hamburg02.jpg|169946290|https://digital.lib.uiowa.edu/,,,,,,,,,,,,,,,,,,,,,,,,,,,,,,,,,,,,,,,,,,,,,,,,"<a href=""https://digital.lib.uiowa.edu/"" target=""_blank"">View this item in its source respository</a>",,,,,,,,,,,,,,,,,,,,,,,,,,,,,http://www.iowaheritage.org/files/original/46a553e73da4b985f8c8e35a78e0409b.jpg,"Remote Item","John P. Vander Maas Railroadiana",1,0
