 




﻿"Item Id","Item URI","Dublin Core:Title","Dublin Core:Subject","Dublin Core:Description","Dublin Core:Creator","Dublin Core:Source","Dublin Core:Publisher","Dublin Core:Date","Dublin Core:Contributor","Dublin Core:Rights","Dublin Core:Relation","Dublin Core:Format","Dublin Core:Language","Dublin Core:Type","Dublin Core:Identifier","Dublin Core:Coverage","Item Type Metadata:Text","Item Type Metadata:Interviewer","Item Type Metadata:Interviewee","Item Type Metadata:Location","Item Type Metadata:Transcription","Item Type Metadata:Local URL","Item Type Metadata:Original Format","Item Type Metadata:Physical Dimensions","Item Type Metadata:Duration","Item Type Metadata:Compression","Item Type Metadata:Producer","Item Type Metadata:Director","Item Type Metadata:Bit Rate/Frequency","Item Type Metadata:Time Summary","Item Type Metadata:Email Body","Item Type Metadata:Subject Line","Item Type Metadata:From","Item Type Metadata:To","Item Type Metadata:CC","Item Type Metadata:BCC","Item Type Metadata:Number of Attachments","Item Type Metadata:Standards","Item Type Metadata:Objectives","Item Type Metadata:Materials","Item Type Metadata:Lesson Plan Text","Item Type Metadata:URL","Item Type Metadata:Event Type","Item Type Metadata:Participants","Item Type Metadata:Birth Date","Item Type Metadata:Birthplace","Item Type Metadata:Death Date","Item Type Metadata:Occupation","Item Type Metadata:Biographical Text","Item Type Metadata:Bibliography","Item Type Metadata:Digital Reproduction Information","Item Type Metadata:Repository","Item Type Metadata:Repository Collection","Item Type Metadata:Contact information.","Item Type Metadata:File Name","Item Type Metadata:Notes","Item Type Metadata:Digital item created","Item Type Metadata:Digital item modified","Item Type Metadata:Executive Orders","Item Type Metadata:Record Created","Item Type Metadata:Record Modified","Item Type Metadata:Transcription2","Item Type Metadata:Source URL","Omeka Legacy File:Additional Creator","Omeka Legacy File:Transcriber","Omeka Legacy File:Producer","Omeka Legacy File:Render Device","Omeka Legacy File:Render Details","Omeka Legacy File:Capture Date","Omeka Legacy File:Capture Device","Omeka Legacy File:Capture Details","Omeka Legacy File:Change History","Omeka Legacy File:Watermark","Omeka Legacy File:Encryption","Omeka Legacy File:Compression","Omeka Legacy File:Post Processing","Omeka Image File:Width","Omeka Image File:Height","Omeka Image File:Bit Depth","Omeka Image File:Channels","Omeka Image File:Exif String","Omeka Image File:Exif Array","Omeka Image File:IPTC String","Omeka Image File:IPTC Array","Omeka Video File:Bitrate","Omeka Video File:Duration","Omeka Video File:Sample Rate","Omeka Video File:Codec","Omeka Video File:Width","Omeka Video File:Height",tags,file,itemType,collection,public,featured
97181,http://www.iowaheritage.org/items/show/97181,"Stormy day","Henry County, Iowa|Agriculture ","Color slides of bent over crops in field on a stormy day. (2)","Henry County Soil and Water Conservation District",,"State Library of Iowa ",1980s,"Henry County Soil and Water Conservation District, Henry County, Iowa.For questions about copyright, contact the State Library of Iowa at <a>http://www.statelibraryofiowa.org.&gt;</a>","This item is protected by copyright and/or related rights. Your are free to use this Item in any way that is permitted by the copyright and related rights legislation that applies to your use. For other uses you need to obtain permission from the rights-holder(s). <a href=""http://rightsstatements.org/"">http://rightsstatements.org</a>",,jpg,eng,"Still Image; Slide",,,,,,,,,,,,,,,,,,,,,,,,,,,,,,,,,,,,,,,,,Cloudy_Day_Unidentified_Crop_in_Field_1980s|Cloudy_Day_Unidentified_Crop_in_Field2_1980s,,,,,,,,,,,,,,,,,,,,,,,,,,,,,,,,,,,,"Agriculture,Henry County Soil and Water Conservation District","http://www.iowaheritage.org/files/original/9dbd92fc81c7790fbb8b5c3a69891811.jpg,http://www.iowaheritage.org/files/original/b157874165ee32e4d8f9e141b7de8b57.jpg","Still Image","Henry County Soil and Water Conservation District Historical Collection ",1,0
97182,http://www.iowaheritage.org/items/show/97182,"Cornfield after heavy rain","Henry County, Iowa|Agriculture ","Color slide of corn field after heavy rain.","Henry County Soil and Water Conservation District",,"State Library of Iowa ",1985,"Henry County Soil and Water Conservation District, Henry County, Iowa.For questions about copyright, contact the State Library of Iowa at <a>http://www.statelibraryofiowa.org.&gt;</a>","This item is protected by copyright and/or related rights. Your are free to use this Item in any way that is permitted by the copyright and related rights legislation that applies to your use. For other uses you need to obtain permission from the rights-holder(s). <a href=""http://rightsstatements.org/"">http://rightsstatements.org</a>",,jpg,eng,"Still Image; Slide",,,,,,,,,,,,,,,,,,,,,,,,,,,,,,,,,,,,,,,,,Corn_Field_After_Heavy_Rain_1985,,,,,,,,,,,,,,,,,,,,,,,,,,,,,,,,,,,,"Agriculture,Henry County Soil and Water Conservation District",http://www.iowaheritage.org/files/original/a32c802912edd1e1a4007d3053737183.jpg,"Still Image","Henry County Soil and Water Conservation District Historical Collection ",1,0
97183,http://www.iowaheritage.org/items/show/97183,"Cornfield with red post","Henry County, Iowa|Agriculture ","Color slides of a muddy corn field with a red post. ","Henry County Soil and Water Conservation District",,"State Library of Iowa ",1980s,"Henry County Soil and Water Conservation District, Henry County, Iowa.For questions about copyright, contact the State Library of Iowa at <a>http://www.statelibraryofiowa.org.&gt;</a>","This item is protected by copyright and/or related rights. Your are free to use this Item in any way that is permitted by the copyright and related rights legislation that applies to your use. For other uses you need to obtain permission from the rights-holder(s). <a href=""http://rightsstatements.org/"">http://rightsstatements.org</a>",,jpg,eng,"Still Image; Slide",,,,,,,,,,,,,,,,,,,,,,,,,,,,,,,,,,,,,,,,,Cornfield_with_Red_Post_1980s|Cornfiield_with_Red_Post2,,,,,,,,,,,,,,,,,,,,,,,,,,,,,,,,,,,,"Agriculture,Henry County Soil and Water Conservation District","http://www.iowaheritage.org/files/original/4970295e69adf8e8a02779ab3e4bea34.jpg,http://www.iowaheritage.org/files/original/b11d2d9e0cc389684d07f041666210a6.jpg","Still Image","Henry County Soil and Water Conservation District Historical Collection ",1,0
97190,http://www.iowaheritage.org/items/show/97190,"Green pasture","Henry County, Iowa|Agriculture ","Color slides of green pasture with cropland in the distance. (2)","Henry County Soil and Water Conservation District",,"State Library of Iowa ",1983,"Henry County Soil and Water Conservation District, Henry County, Iowa.For questions about copyright, contact the State Library of Iowa at <a>http://www.statelibraryofiowa.org.&gt;</a>","This item is protected by copyright and/or related rights. Your are free to use this Item in any way that is permitted by the copyright and related rights legislation that applies to your use. For other uses you need to obtain permission from the rights-holder(s). <a href=""http://rightsstatements.org/"">http://rightsstatements.org</a>",,jpg,eng,"Still Image; Slide",,,,,,,,,,,,,,,,,,,,,,,,,,,,,,,,,,,,,,,,,Grassy_Field_Corn_in_Distance_1983|Green_Pasture_1983,,,,,,,,,,,,,,,,,,,,,,,,,,,,,,,,,,,,"Agriculture,Henry County Soil and Water Conservation District","http://www.iowaheritage.org/files/original/e553c335ca1e51b30ba97ece0b3203d1.jpg,http://www.iowaheritage.org/files/original/2dfc69005193a1620b62951a9d2806f1.jpg","Still Image","Henry County Soil and Water Conservation District Historical Collection ",1,0
97208,http://www.iowaheritage.org/items/show/97208,"Wheels of planter","Henry County, Iowa|Agriculture ","Color slide of wheels of a planter sewing seed on dry earth. ","Henry County Soil and Water Conservation District",,"State Library of Iowa ",1983,"Henry County Soil and Water Conservation District, Henry County, Iowa.For questions about copyright, contact the State Library of Iowa at <a>http://www.statelibraryofiowa.org.&gt;</a>","This item is protected by copyright and/or related rights. Your are free to use this Item in any way that is permitted by the copyright and related rights legislation that applies to your use. For other uses you need to obtain permission from the rights-holder(s). <a href=""http://rightsstatements.org/"">http://rightsstatements.org</a>",,jpg,eng,"Still Image; Slide",,,,,,,,,,,,,,,,,,,,,,,,,,,,,,,,,,,,,,,,,Wheels_of_Planter__Sewing_Seed_1983,,,,,,,,,,,,,,,,,,,,,,,,,,,,,,,,,,,,"Agriculture,Henry County Soil and Water Conservation District",http://www.iowaheritage.org/files/original/172d8636a3e35dffea3df3c89a335847.jpg,"Still Image","Henry County Soil and Water Conservation District Historical Collection ",1,0
97210,http://www.iowaheritage.org/items/show/97210,"Ken Clark wilted corn","Clark, Ken|Agriculture ","Color slide of wilted corn on Ken Clark's cropland.","Henry County Soil and Water Conservation District",,"State Library of Iowa ",1980s,"Henry County Soil and Water Conservation District, Henry County, Iowa.For questions about copyright, contact the State Library of Iowa at <a>http://www.statelibraryofiowa.org.&gt;</a>","This item is protected by copyright and/or related rights. Your are free to use this Item in any way that is permitted by the copyright and related rights legislation that applies to your use. For other uses you need to obtain permission from the rights-holder(s). <a href=""http://rightsstatements.org/"">http://rightsstatements.org</a>",,jpg,eng,"Still Image; Slide",,,,,,,,,,,,,,,,,,,,,,,,,,,,,,,,,,,,,,,,,Wilted_Corn_in_Dry_Field__Ken_Clark_1980s,,,,,,,,,,,,,,,,,,,,,,,,,,,,,,,,,,,,"Agriculture,Henry County Soil and Water Conservation District,Ken Clark",http://www.iowaheritage.org/files/original/10587603aa835e88e22e8abe52d96664.jpg,"Still Image","Henry County Soil and Water Conservation District Historical Collection ",1,0
97214,http://www.iowaheritage.org/items/show/97214,"Cornfield after harvest","Henry County Soil and Water Conservation District |Agriculture ","Color slide of a cornfield after harvest. ","Henry County Soil and Water Conservation District",,"State Library of Iowa",,"Henry County Soil and Water Conservation District of Iowa. For questions about copyright, contact the State Library of Iowa at  <a href=""http://www.statelibraryofiowa.org"">http://www.statelibraryofiowa.org</a>.","This item is protected by copyright and/or related rights. Your are free to use this Item in any way that is permitted by the copyright and related rights legislation that applies to your use. For other uses you need to obtain permission from the rights-holder(s). <a href=""http://rightsstatements.org/"">http://rightsstatements.org</a>",,pdf,eng,"Text: Document ",,,,,,,,,,,,,,,,,,,,,,,,,,,,,,,,,,,,,,,,,Cornfield_After_Harvest_1980s,,,,,,,,,,,,,,,,,,,,,,,,,,,,,,,,,,,,"Agriculture,Henry County Soil and Water Conservation District",http://www.iowaheritage.org/files/original/011ed5eeb1f507690d587df7f117ce1f.jpg,"Still Image","Henry County Soil and Water Conservation District Historical Collection ",1,0
97265,http://www.iowaheritage.org/items/show/97265,"Farm Weekly, 1972","Ida County, Iowa |Soil and Water Conservation |Terracing |Agriculture","A weekly publication highlighting various soil and water conservation activities by farmers in Iowa and Nebraska. ","The Sioux City Journal ",,"State Library of Iowa",1972-10-16,"Ida County Soil and Water Conservation District of Iowa. For questions about copyright, contact the State Library of Iowa at  <a href=""http://www.statelibraryofiowa.org"">http://www.statelibraryofiowa.org</a>.","This item is protected by copyright and/or related rights. Your are free to use this Item in any way that is permitted by the copyright and related rights legislation that applies to your use. For other uses you need to obtain permission from the rights-holder(s). <a href=""http://rightsstatements.org/"">http://rightsstatements.org</a>",,pdf,eng,"Text; Newspaper ",,,,,,,,,,,,,,,,,,,,,,,,,,,,,,,,,,,,,,,,,Farm_Weekly_1972_,,,,,,,,,,,,,,,,,,,,,,,,,,,,,,,,,,,,"Agriculture,Ida County Soil and Water Conservation District,Soil and Water Conservation",http://www.iowaheritage.org/files/original/0dde31649b48a2075f7e677f9e67e1b8.pdf,Document,"Ida County Soil and Water Conservation District Historical Collection ",1,0
97268,http://www.iowaheritage.org/items/show/97268,"Soil Erosion, 1986","Ida County Soil and Water Conservation District |Soil Conservation |Agriculture ","Series of color slides of farmland and rural areas after heavy rains with marked signs of soil erosion. (14)","Ida County Soil and Water Conservation District ",,"State Library of Iowa",1986-05,"Ida County Soil and Water Conservation District of Iowa. For questions about copyright, contact the State Library of Iowa at  <a href=""http://www.statelibraryofiowa.org"">http://www.statelibraryofiowa.org</a>.","This item is protected by copyright and/or related rights. Your are free to use this Item in any way that is permitted by the copyright and related rights legislation that applies to your use. For other uses you need to obtain permission from the rights-holder(s). <a href=""http://rightsstatements.org/"">http://rightsstatements.org</a>",,jpg,,"Still Image; Slide",,,,,,,,,,,,,,,,,,,,,,,,,,,,,,,,,,,,,,,,,Waterstream_Runs_Downhill_Cropland_May_1986_Page_1_Image_0001|Water_Stream_Running_Down_Field_May_1986_Page_1_Image_0001|Water_Stream_on_Green_Field_May_1986_Page_1_Image_0001|Water_Stands-in_Dirt_Field__May_1986_Page_1_Image_0001|Water_Stands_in_Field_Near_Fence_May_1986_Page_1_Image_0001|Water_Stands_in_Field_By_Fence2__May_1986_Page_1_Image_0001|Water_Stands_in_Field_by_Fence_May_1986_Page_1_Image_0001|Muddy_Road_and_Field_by_Stop_Sign_May_1986_Page_1_Image_0001|Muddy_Field2_May_1986_Page_1_Image_0001|Man_Stands_inDirt_Field__Westside_Site_2-3_May_1986_Page_1_Image_0001|Man_Stands_by_Fence_in_Field_May_1986_Page_1_Image_0001|Gully_with_Water_Green_Pasture_May_1986_Page_1_Image_0001|_Muddy_Field3_May_1986_Page_1_Image_0001,,,,,,,,,,,,,,,,,,,,,,,,,,,,,,,,,,,,"Ida County Soil and Water Conservation District,Soil Erosion","http://www.iowaheritage.org/files/original/ace835b789d27fc66672ebcbd5351999.jpg,http://www.iowaheritage.org/files/original/5521885d3def7ffcb78512b5a1b88f42.jpg,http://www.iowaheritage.org/files/original/4b7ae525bdeafb13dcb63edd5fbb4f67.jpg,http://www.iowaheritage.org/files/original/9b1a9557e95d2b4ccad4226b9f8105bf.jpg,http://www.iowaheritage.org/files/original/0d2f40fff3ea4153575b951571987a07.jpg,http://www.iowaheritage.org/files/original/52aa58cffe355fbd9601d8e7f611b285.jpg,http://www.iowaheritage.org/files/original/380a14398b055fb5d85b4d2081c788f9.jpg,http://www.iowaheritage.org/files/original/1d7d782de872aedb52d6ac8a2fa09e71.jpg,http://www.iowaheritage.org/files/original/b91eeefbd59406d2539a0dcf6a7eecb4.jpg,http://www.iowaheritage.org/files/original/cb058a21c586463903f3a797f2375b2f.jpg,http://www.iowaheritage.org/files/original/2085e1987ce49a70714fe164ee003fe5.jpg,http://www.iowaheritage.org/files/original/0193c816645eeb2cec0e421f6ec3f444.jpg,http://www.iowaheritage.org/files/original/56eb707ec53065ae98691faef7d7f744.jpg,http://www.iowaheritage.org/files/original/4592a4ca7ae39cbcd95de8d122261fb2.jpg","Still Image","Ida County Soil and Water Conservation District Historical Collection ",1,0
97271,http://www.iowaheritage.org/items/show/97271,"Dry cropland, 1988","Ida County Soil and Water Conservation District |Agriculture ","Series of color slides of dry cropland. (14)","Ida County Soil and Water Conservation District ",,"State Library of Iowa",,"Ida County Soil and Water Conservation District of Iowa. For questions about copyright, contact the State Library of Iowa at  <a href=""http://www.statelibraryofiowa.org"">http://www.statelibraryofiowa.org</a>.","This item is protected by copyright and/or related rights. Your are free to use this Item in any way that is permitted by the copyright and related rights legislation that applies to your use. For other uses you need to obtain permission from the rights-holder(s). <a href=""http://rightsstatements.org/"">http://rightsstatements.org</a>",,jpg,,"Still Image; Slide",,,,,,,,,,,,,,,,,,,,,,,,,,,,,,,,,,,,,,,,,"Corn_Stubble_in_Field_May_1988_Page_1_Image_0001|Corn_Stubble_in_Field2_May_1988_Page_1_Image_0001|Crop_Stubble_Page_1_Image_0001|Crop_Stubble_Pasture_in_Back_Page_1_Image_0001|Crop_Stubble_with_Back_Pasture2_Page_1_Image_0001|Crop_Stubble2_Page_1_Image_0001|Crop_Stubble3_Page_1_Image_0001|Crop_Stubble4_Page_1_Image_0001|Crop_Stubble5_Page_1_Image_0001|Crop_Stubble6_May_1988_Page_1_Image_0001|Crop_Stubble7_May_1988_Page_1_Image_0001|Crop_Stubbles_3_May_1988_Page_1_Image_0001|Crop_Stubbles4_May_1988_Page_1_Image_0001|Crop_Stubbles2_May_1988_Page_1_Image_0001|Crop_stubbles2_May 1988_Page_1_Image_0001",,,,,,,,,,,,,,,,,,,,,,,,,,,,,,,,,,,,"Cropland,Ida County Soil and Water Conservation District","http://www.iowaheritage.org/files/original/750f54da4d3dedaa10d847de56c62ca2.jpg,http://www.iowaheritage.org/files/original/70f74257ed2874062e85defceadb6a84.jpg,http://www.iowaheritage.org/files/original/262e3b332a4c8a0e5ceeac1d6ef5563a.jpg,http://www.iowaheritage.org/files/original/055cb23bbe5fa0606e2268d1792cc704.jpg,http://www.iowaheritage.org/files/original/b2fb386becdc6ddeae7fb1383b0618e0.jpg,http://www.iowaheritage.org/files/original/afaf9fbc15d14f8c62d8e0eb26d64097.jpg,http://www.iowaheritage.org/files/original/b2331474ebd66e8901f394e63a34b36f.jpg,http://www.iowaheritage.org/files/original/3f95c97b2bcd8203aa394e2f20ea2ef9.jpg,http://www.iowaheritage.org/files/original/31f936672751acf2521f4049df8b22db.jpg,http://www.iowaheritage.org/files/original/18af1121f4181cf6bce6aaca9e587124.jpg,http://www.iowaheritage.org/files/original/00086dded5c050c9cd8d1d979b76c587.jpg,http://www.iowaheritage.org/files/original/a67e9b2225fec57570410c8b00af6555.jpg,http://www.iowaheritage.org/files/original/1687a2de1b26d3b7114199298efe1475.jpg,http://www.iowaheritage.org/files/original/414aee5be2a4ac3f3ef954eba8182f77.jpg","Still Image","Ida County Soil and Water Conservation District Historical Collection ",1,0
