 




﻿"Item Id","Item URI","Dublin Core:Title","Dublin Core:Subject","Dublin Core:Description","Dublin Core:Creator","Dublin Core:Source","Dublin Core:Publisher","Dublin Core:Date","Dublin Core:Contributor","Dublin Core:Rights","Dublin Core:Relation","Dublin Core:Format","Dublin Core:Language","Dublin Core:Type","Dublin Core:Identifier","Dublin Core:Coverage","Item Type Metadata:Text","Item Type Metadata:Interviewer","Item Type Metadata:Interviewee","Item Type Metadata:Location","Item Type Metadata:Transcription","Item Type Metadata:Local URL","Item Type Metadata:Original Format","Item Type Metadata:Physical Dimensions","Item Type Metadata:Duration","Item Type Metadata:Compression","Item Type Metadata:Producer","Item Type Metadata:Director","Item Type Metadata:Bit Rate/Frequency","Item Type Metadata:Time Summary","Item Type Metadata:Email Body","Item Type Metadata:Subject Line","Item Type Metadata:From","Item Type Metadata:To","Item Type Metadata:CC","Item Type Metadata:BCC","Item Type Metadata:Number of Attachments","Item Type Metadata:Standards","Item Type Metadata:Objectives","Item Type Metadata:Materials","Item Type Metadata:Lesson Plan Text","Item Type Metadata:URL","Item Type Metadata:Event Type","Item Type Metadata:Participants","Item Type Metadata:Birth Date","Item Type Metadata:Birthplace","Item Type Metadata:Death Date","Item Type Metadata:Occupation","Item Type Metadata:Biographical Text","Item Type Metadata:Bibliography","Item Type Metadata:Digital Reproduction Information","Item Type Metadata:Repository","Item Type Metadata:Repository Collection","Item Type Metadata:Contact information.","Item Type Metadata:File Name","Item Type Metadata:Notes","Item Type Metadata:Digital item created","Item Type Metadata:Digital item modified","Item Type Metadata:Executive Orders","Item Type Metadata:Record Created","Item Type Metadata:Record Modified","Item Type Metadata:Transcription2","Item Type Metadata:Source URL","Omeka Legacy File:Additional Creator","Omeka Legacy File:Transcriber","Omeka Legacy File:Producer","Omeka Legacy File:Render Device","Omeka Legacy File:Render Details","Omeka Legacy File:Capture Date","Omeka Legacy File:Capture Device","Omeka Legacy File:Capture Details","Omeka Legacy File:Change History","Omeka Legacy File:Watermark","Omeka Legacy File:Encryption","Omeka Legacy File:Compression","Omeka Legacy File:Post Processing","Omeka Image File:Width","Omeka Image File:Height","Omeka Image File:Bit Depth","Omeka Image File:Channels","Omeka Image File:Exif String","Omeka Image File:Exif Array","Omeka Image File:IPTC String","Omeka Image File:IPTC Array","Omeka Video File:Bitrate","Omeka Video File:Duration","Omeka Video File:Sample Rate","Omeka Video File:Codec","Omeka Video File:Width","Omeka Video File:Height",tags,file,itemType,collection,public,featured
35674,http://www.iowaheritage.org/items/show/35674,"Mary Louise Smith laughing, Detroit, Mich., between 1980 and 1984","Men|Smith, Mary Louise|United States -- Michigan -- Detroit|1980-1990|Women|Activists",,unknown,,"University of Iowa. Libraries. Iowa Women's Archives",1980/1989|2007-09-13,,"Educational use only, no other permissions given. U.S. and international copyright laws may protect this item. Commercial use or distribution of this digital object is not permitted without written permission of the Iowa Women's Archives.","Iowa Women's Archives Founders|Mary Louise Smith Papers, 1914-1997|http://lib.uiowa.edu/collguides/?IWA0027|MLS et al., site selection committee, Detroit, 1980 or 1984",jpeg,,"Still image|Photographs",IWA0027|mls0108.jpg|https://digital.lib.uiowa.edu/,,,,,,,,,,,,,,,,,,,,,,,,,,,,,,,,,,,,,,,,,,,,,,,,"<a href=""https://digital.lib.uiowa.edu/"" target=""_blank"">View this item in its source respository</a>",,,,,,,,,,,,,,,,,,,,,,,,,,,,,http://www.iowaheritage.org/files/original/0341b02bdedb2e233d6dc8ab27d051c5.jpg,"Remote Item","Iowa Women's Archives Founders",1,0
35672,http://www.iowaheritage.org/items/show/35672,"Gov. Robert Ray, Marvin Pomerantz, Billie Ray, and Mary Louise Smith, September 1, 1978","Men|Ray, Billie|United States -- Iowa|1970-1980|Women|Governors|Activists|Ray, Robert D., 1928-|Pomerantz, Marvin, 1930-|Smith, Mary Louise",,unknown,,"University of Iowa. Libraries. Iowa Women's Archives",1978-09-01|2007-09-13,,"Educational use only, no other permissions given. U.S. and international copyright laws may protect this item. Commercial use or distribution of this digital object is not permitted without written permission of the Iowa Women's Archives.","Iowa Women's Archives Founders|Mary Louise Smith Papers, 1914-1997|http://lib.uiowa.edu/collguides/?IWA0027|MLS et al., 1977-1980",jpeg,,"Still image|Photographs",IWA0027|mls0082.jpg|https://digital.lib.uiowa.edu/,,,,,,,,,,,,,,,,,,,,,,,,,,,,,,,,,,,,,,,,,,,,,,,,"<a href=""https://digital.lib.uiowa.edu/"" target=""_blank"">View this item in its source respository</a>",,,,,,,,,,,,,,,,,,,,,,,,,,,,,http://www.iowaheritage.org/files/original/559120dfc0034915e16ec745b4677757.jpg,"Remote Item","Iowa Women's Archives Founders",1,0
35671,http://www.iowaheritage.org/items/show/35671,"Mary Louise Smith with Harold Stassen at Lincoln Day Dinner, Des Moines, Iowa,  May 21, 1979","Men|Smith, Mary Louise|United States -- Iowa -- Des Moines|1970-1980|Women|Activists|Governors|Stassen, Harold Edward, 1907-2001",,unknown,,"University of Iowa. Libraries. Iowa Women's Archives",1979-05-21|2007-09-13,,"Educational use only, no other permissions given. U.S. and international copyright laws may protect this item. Commercial use or distribution of this digital object is not permitted without written permission of the Iowa Women's Archives.","Iowa Women's Archives Founders|Mary Louise Smith Papers, 1914-1997|http://lib.uiowa.edu/collguides/?IWA0027|MLS et al., 1977-1980",jpeg,,"Still image|Photographs",IWA0027|mls0075.jpg|https://digital.lib.uiowa.edu/,,,,,,,,,,,,,,,,,,,,,,,,,,,,,,,,,,,,,,,,,,,,,,,,"<a href=""https://digital.lib.uiowa.edu/"" target=""_blank"">View this item in its source respository</a>",,,,,,,,,,,,,,,,,,,,,,,,,,,,,http://www.iowaheritage.org/files/original/06aec80ff59d863eb804e71ea4d65e86.jpg,"Remote Item","Iowa Women's Archives Founders",1,0
35670,http://www.iowaheritage.org/items/show/35670,"Mary Louise Smith and Vice Pres. Nelson Rockefeller at the Lincoln Day Dinner, Des Moines, Iowa, April 1976","Men|Smith, Mary Louise|United States -- Iowa -- Des Moines|1970-1980|Women|Vice presidents|Politicians|Activists|Rockefeller, Nelson A. (Nelson Aldrich), 1908-1979",,unknown,,"University of Iowa. Libraries. Iowa Women's Archives",1976-04|2007-09-13,,"Educational use only, no other permissions given. U.S. and international copyright laws may protect this item. Commercial use or distribution of this digital object is not permitted without written permission of the Iowa Women's Archives.","Iowa Women's Archives Founders|Mary Louise Smith Papers, 1914-1997|http://lib.uiowa.edu/collguides/?IWA0027|MLS et al., 1976, general",jpeg,,"Still image|Photographs",IWA0027|mls0065.jpg|https://digital.lib.uiowa.edu/,,,,,,,,,,,,,,,,,,,,,,,,,,,,,,,,,,,,,,,,,,,,,,,,"<a href=""https://digital.lib.uiowa.edu/"" target=""_blank"">View this item in its source respository</a>",,,,,,,,,,,,,,,,,,,,,,,,,,,,,http://www.iowaheritage.org/files/original/cd792177b8c9e0485c709f77dce4ad54.jpg,"Remote Item","Iowa Women's Archives Founders",1,0
35664,http://www.iowaheritage.org/items/show/35664,"Mary Louise Smith presenting a report at the Iowa Women's Archives board meeting, Iowa City, Iowa, October 1991","Women|Smith, Mary Louise|University of Iowa|United States -- Iowa -- Iowa City|1990-2000|Activists|Civic leaders|Public speaking|University of Iowa. Libraries. Iowa Women's Archives|","University of Iowa Foundation meeting",unknown,,"University of Iowa. Libraries. Iowa Women's Archives",1991-10|2007-09-13,,"Educational use only, no other permissions given. U.S. and international copyright laws may protect this item. Commercial use or distribution of this digital object is not permitted without written permission of the Iowa Women's Archives.","Iowa Women's Archives Founders|Mary Louise Smith Papers, 1914-1997|http://lib.uiowa.edu/collguides/?IWA0027",jpeg,,"Still image|Photographs",IWA0027|https://digital.lib.uiowa.edu/,,,,,,,,,,,,,,,,,,,,,,,,,,,,,,,,,,,,,,,,,,,,,,,,"<a href=""https://digital.lib.uiowa.edu/"" target=""_blank"">View this item in its source respository</a>",,,,,,,,,,,,,,,,,,,,,,,,,,,,,http://www.iowaheritage.org/files/original/2c5db106cdd10fcdae2d1de558082841.jpg,"Remote Item","Iowa Women's Archives Founders",1,0
35649,http://www.iowaheritage.org/items/show/35649,"Mary Louise Smith with two other women in formal dress, Washington, D.C.,  1970s?","Women|Smith, Mary Louise|United States -- Washington (D.C.)|1970-1980|Activists|Ball dresses",,unknown,,"Chase Studios|University of Iowa. Libraries. Iowa Women's Archives",1970/1979|2007-09-13,,"Educational use only, no other permissions given. U.S. and international copyright laws may protect this item. Commercial use or distribution of this digital object is not permitted without written permission of the Iowa Women's Archives.","Iowa Women's Archives Founders|Mary Louise Smith Papers, 1914-1997|http://lib.uiowa.edu/collguides/?IWA0027|MLS with husband and others",jpeg,,"Still image|Photographs",IWA0027|https://digital.lib.uiowa.edu/,,,,,,,,,,,,,,,,,,,,,,,,,,,,,,,,,,,,,,,,,,,,,,,,"<a href=""https://digital.lib.uiowa.edu/"" target=""_blank"">View this item in its source respository</a>",,,,,,,,,,,,,,,,,,,,,,,,,,,,,http://www.iowaheritage.org/files/original/a08018984545e7ce162e60a4ef7b76f1.jpg,"Remote Item","Iowa Women's Archives Founders",1,0
35648,http://www.iowaheritage.org/items/show/35648,"Mary Louise Smith at Mount Rushmore, S.D., June 13, 1975","Women|Mount Rushmore National Memorial (S.D.)|Smith, Mary Louise|United States -- South Dakota|1970-1980|Activists",,unknown,,"University of Iowa. Libraries. Iowa Women's Archives",1975-06-13|2007-09-13,,"Educational use only, no other permissions given. U.S. and international copyright laws may protect this item. Commercial use or distribution of this digital object is not permitted without written permission of the Iowa Women's Archives.","Iowa Women's Archives Founders|Mary Louise Smith Papers, 1914-1997|http://lib.uiowa.edu/collguides/?IWA0027|MLS at Mt. Rushmore, June 13, 1975",jpeg,,"Still image|Photographs",IWA0027|https://digital.lib.uiowa.edu/,,,,,,,,,,,,,,,,,,,,,,,,,,,,,,,,,,,,,,,,,,,,,,,,"<a href=""https://digital.lib.uiowa.edu/"" target=""_blank"">View this item in its source respository</a>",,,,,,,,,,,,,,,,,,,,,,,,,,,,,http://www.iowaheritage.org/files/original/6797c1324162306db82416742882b383.jpg,"Remote Item","Iowa Women's Archives Founders",1,0
35646,http://www.iowaheritage.org/items/show/35646,"Mary Louise Smith with Richard V. West, Jr.  Pres. George H. W. Bush, and friends, 1970s","Men|Smith, Mary Louise|Tesoro Petroleum Corporation|United States|1970-1980|Women|Business people|Presidents|Activists|Bush, George, 1924-|West, Robert V.","""Chairman of the Board, Tesoro Petroleum Corporation, 8700 Tesoro Drive, San Antonio, Texas 78286, area code 512-838-8484""--Verso.",unknown,,"University of Iowa. Libraries. Iowa Women's Archives",1970/1979|2007-09-13,,"Educational use only, no other permissions given. U.S. and international copyright laws may protect this item. Commercial use or distribution of this digital object is not permitted without written permission of the Iowa Women's Archives.","Iowa Women's Archives Founders|Mary Louise Smith Papers, 1914-1997|http://lib.uiowa.edu/collguides/?IWA0027|MLS with George Bush",jpeg,,"Still image|Photographs",IWA0027|https://digital.lib.uiowa.edu/,,,,,,,,,,,,,,,,,,,,,,,,,,,,,,,,,,,,,,,,,,,,,,,,"<a href=""https://digital.lib.uiowa.edu/"" target=""_blank"">View this item in its source respository</a>",,,,,,,,,,,,,,,,,,,,,,,,,,,,,http://www.iowaheritage.org/files/original/408d6c3e03d59c284dfa5a8435f6a34c.jpg,"Remote Item","Iowa Women's Archives Founders",1,0
35644,http://www.iowaheritage.org/items/show/35644,"Mary Louise Smith wearing corsage, Waukesha, Wis., February 8, 1975","Men|Smith, Mary Louise|United States -- Wisconsin -- Waukesha|1970-1980|Women|Activists|Flowers",,unknown,,"Ankers Capitol Photographers|University of Iowa. Libraries. Iowa Women's Archives",1975-02-08|2007-09-13,,"Educational use only, no other permissions given. U.S. and international copyright laws may protect this item. Commercial use or distribution of this digital object is not permitted without written permission of the Iowa Women's Archives.","Iowa Women's Archives Founders|Mary Louise Smith Papers, 1914-1997|http://lib.uiowa.edu/collguides/?IWA0027|MLS and others at Waukesha, Wisconsin 2/8/75",jpeg,,"Still image|Photographs",IWA0027|https://digital.lib.uiowa.edu/,,,,,,,,,,,,,,,,,,,,,,,,,,,,,,,,,,,,,,,,,,,,,,,,"<a href=""https://digital.lib.uiowa.edu/"" target=""_blank"">View this item in its source respository</a>",,,,,,,,,,,,,,,,,,,,,,,,,,,,,http://www.iowaheritage.org/files/original/9e35d2803cbe0310a57e75ce21ea585d.jpg,"Remote Item","Iowa Women's Archives Founders",1,0
35640,http://www.iowaheritage.org/items/show/35640,"Mary Louise talking with men, Waukesha, Wis., February 8, 1975","Men|Smith, Mary Louise|United States -- Wisconsin -- Waukesha|1970-1980|Women|Activists",,unknown,,"Ankers Capitol Photographers|University of Iowa. Libraries. Iowa Women's Archives",1975-02-08|2007-09-13,,"Educational use only, no other permissions given. U.S. and international copyright laws may protect this item. Commercial use or distribution of this digital object is not permitted without written permission of the Iowa Women's Archives.","Iowa Women's Archives Founders|Mary Louise Smith Papers, 1914-1997|http://lib.uiowa.edu/collguides/?IWA0027|MLS and others at Waukesha, Wisconsin 2/8/75",jpeg,,"Still image|Photographs",IWA0027|https://digital.lib.uiowa.edu/,,,,,,,,,,,,,,,,,,,,,,,,,,,,,,,,,,,,,,,,,,,,,,,,"<a href=""https://digital.lib.uiowa.edu/"" target=""_blank"">View this item in its source respository</a>",,,,,,,,,,,,,,,,,,,,,,,,,,,,,http://www.iowaheritage.org/files/original/0666128ad9966b365ddaafcb6ea1d8ff.jpg,"Remote Item","Iowa Women's Archives Founders",1,0
