 




﻿"Item Id","Item URI","Dublin Core:Title","Dublin Core:Subject","Dublin Core:Description","Dublin Core:Creator","Dublin Core:Source","Dublin Core:Publisher","Dublin Core:Date","Dublin Core:Contributor","Dublin Core:Rights","Dublin Core:Relation","Dublin Core:Format","Dublin Core:Language","Dublin Core:Type","Dublin Core:Identifier","Dublin Core:Coverage","Item Type Metadata:Text","Item Type Metadata:Interviewer","Item Type Metadata:Interviewee","Item Type Metadata:Location","Item Type Metadata:Transcription","Item Type Metadata:Local URL","Item Type Metadata:Original Format","Item Type Metadata:Physical Dimensions","Item Type Metadata:Duration","Item Type Metadata:Compression","Item Type Metadata:Producer","Item Type Metadata:Director","Item Type Metadata:Bit Rate/Frequency","Item Type Metadata:Time Summary","Item Type Metadata:Email Body","Item Type Metadata:Subject Line","Item Type Metadata:From","Item Type Metadata:To","Item Type Metadata:CC","Item Type Metadata:BCC","Item Type Metadata:Number of Attachments","Item Type Metadata:Standards","Item Type Metadata:Objectives","Item Type Metadata:Materials","Item Type Metadata:Lesson Plan Text","Item Type Metadata:URL","Item Type Metadata:Event Type","Item Type Metadata:Participants","Item Type Metadata:Birth Date","Item Type Metadata:Birthplace","Item Type Metadata:Death Date","Item Type Metadata:Occupation","Item Type Metadata:Biographical Text","Item Type Metadata:Bibliography","Item Type Metadata:Digital Reproduction Information","Item Type Metadata:Repository","Item Type Metadata:Repository Collection","Item Type Metadata:Contact information.","Item Type Metadata:File Name","Item Type Metadata:Notes","Item Type Metadata:Digital item created","Item Type Metadata:Digital item modified","Item Type Metadata:Executive Orders","Item Type Metadata:Record Created","Item Type Metadata:Record Modified","Item Type Metadata:Transcription2","Item Type Metadata:Source URL","Omeka Legacy File:Additional Creator","Omeka Legacy File:Transcriber","Omeka Legacy File:Producer","Omeka Legacy File:Render Device","Omeka Legacy File:Render Details","Omeka Legacy File:Capture Date","Omeka Legacy File:Capture Device","Omeka Legacy File:Capture Details","Omeka Legacy File:Change History","Omeka Legacy File:Watermark","Omeka Legacy File:Encryption","Omeka Legacy File:Compression","Omeka Legacy File:Post Processing","Omeka Image File:Width","Omeka Image File:Height","Omeka Image File:Bit Depth","Omeka Image File:Channels","Omeka Image File:Exif String","Omeka Image File:Exif Array","Omeka Image File:IPTC String","Omeka Image File:IPTC Array","Omeka Video File:Bitrate","Omeka Video File:Duration","Omeka Video File:Sample Rate","Omeka Video File:Codec","Omeka Video File:Width","Omeka Video File:Height",tags,file,itemType,collection,public,featured
64677,http://www.iowaheritage.org/items/show/64677,"And in farm news today, wet conditions continue to hamper this year's harvest","Farming|Iowa|Farmers|1990-2000|Plants|Harvests|Weather|Rain|Farms|Corn|Houses|Barns|Hair dryers","Has anyone seen my hair dryer?; Whirrrr","Duffy, Brian, 1955-",,"University of Iowa. Libraries. Special Collections Dept.",1992-11-15|2011-04,,"Educational use only, no other permissions given. Copyright to this digital object is owned by The Des Moines Register; it may not be downloaded, reproduced, or distributed without written permission. For more information, contact the Special Collections Department.","Editorial Cartoons of Brian Duffy; Des Moines Register Cartoonists|Papers of Brian Duffy|Des Moines Register",,English,"Still image|Editorial cartoons",MSC916|duffy-921115|http://digital.lib.uiowa.edu/cdm/ref/collection/duffy/id/515,,,,,,,,,,,,,,,,,,,,,,,,,,,,,,,,,,,,,,,,,,,,,,,,"<a href=""http://digital.lib.uiowa.edu/cdm/ref/collection/duffy/id/515"" target=""_blank"">View this item in its source respository</a>",,,,,,,,,,,,,,,,,,,,,,,,,,,,,http://www.iowaheritage.org/files/original/de4c3c93d43fc65c9489d8c5c66c05cc.jpg,"Remote Item","Editorial Cartoons of Brian Duffy",1,0
64550,http://www.iowaheritage.org/items/show/64550,"And this little piggie built his house of bricks","Imports|United States|Pigs|1980-1990|Trade|Trade policy|Tariffs|Taxation|Duty|Pork industry and trade|United States -- Foreign economic relations|Canada|Bricks|Masonry|Bricklaying|Hats|Buckets|Buttons (Fasteners)|Stars","Buy American; Canadian hog import duty","Duffy, Brian, 1955-",,"University of Iowa. Libraries. Special Collections Dept.",1985-03-30|2011-04,,"Educational use only, no other permissions given. Copyright to this digital object is owned by The Des Moines Register; it may not be downloaded, reproduced, or distributed without written permission. For more information, contact the Special Collections Department.","Editorial Cartoons of Brian Duffy; Des Moines Register Cartoonists|Papers of Brian Duffy|Des Moines Register",,English,"Still image|Editorial cartoons",MSC916|duffy-850330|http://digital.lib.uiowa.edu/cdm/ref/collection/duffy/id/388,,,,,,,,,,,,,,,,,,,,,,,,,,,,,,,,,,,,,,,,,,,,,,,,"<a href=""http://digital.lib.uiowa.edu/cdm/ref/collection/duffy/id/388"" target=""_blank"">View this item in its source respository</a>",,,,,,,,,,,,,,,,,,,,,,,,,,,,,http://www.iowaheritage.org/files/original/fff206a2fc7100de675e19396f1b348c.jpg,"Remote Item","Editorial Cartoons of Brian Duffy",1,0
64365,http://www.iowaheritage.org/items/show/64365,"And this one I got for conducting open and fair elections","Presidents|Marcos, Ferdinand E. (Ferdinand Edralin), 1917-1989|Philippines|Presidents|1980-1990|Leadership|Philippines -- Politics and government|Military service|Elections|Democracy|Uniforms|Medals","Marcos; Cracker Jack; Hero","Duffy, Brian, 1955-",,"University of Iowa. Libraries. Special Collections Dept.",1986-01-24|2011-04,,"Educational use only, no other permissions given. Copyright to this digital object is owned by The Des Moines Register; it may not be downloaded, reproduced, or distributed without written permission. For more information, contact the Special Collections Department.","Editorial Cartoons of Brian Duffy; Des Moines Register Cartoonists|Papers of Brian Duffy|Des Moines Register",,English,"Still image|Editorial cartoons",MSC916|duffy-860124|http://digital.lib.uiowa.edu/cdm/ref/collection/duffy/id/203,,,,,,,,,,,,,,,,,,,,,,,,,,,,,,,,,,,,,,,,,,,,,,,,"<a href=""http://digital.lib.uiowa.edu/cdm/ref/collection/duffy/id/203"" target=""_blank"">View this item in its source respository</a>",,,,,,,,,,,,,,,,,,,,,,,,,,,,,http://www.iowaheritage.org/files/original/770887ec819c628566403aaba656f867.jpg,"Remote Item","Editorial Cartoons of Brian Duffy",1,0
64310,http://www.iowaheritage.org/items/show/64310,"And you call yourself an oil man?","Energy|Bush, George W. (George Walker), 1946-|United States|Men|2000-2010|Oil|Oil industry|Business people|Resources|Pickens, T. Boone (Thomas Boone)|Presidents|Papers|Wind|Wind instruments|Engines","We can't drill our way out of this; T. Boone Pickens","Duffy, Brian, 1955-",,"University of Iowa. Libraries. Special Collections Dept.",2008-07-15|2011-04,,"Educational use only, no other permissions given. Copyright to this digital object is owned by The Des Moines Register; it may not be downloaded, reproduced, or distributed without written permission. For more information, contact the Special Collections Department.","Editorial Cartoons of Brian Duffy; Des Moines Register Cartoonists|Papers of Brian Duffy|Des Moines Register",,English,"Still image|Editorial cartoons",MSC916|duffy-080715|http://digital.lib.uiowa.edu/cdm/ref/collection/duffy/id/148,,,,,,,,,,,,,,,,,,,,,,,,,,,,,,,,,,,,,,,,,,,,,,,,"<a href=""http://digital.lib.uiowa.edu/cdm/ref/collection/duffy/id/148"" target=""_blank"">View this item in its source respository</a>",,,,,,,,,,,,,,,,,,,,,,,,,,,,,http://www.iowaheritage.org/files/original/ccca92a008368fbdf41fef1264ae915d.jpg,"Remote Item","Editorial Cartoons of Brian Duffy",1,0
64357,http://www.iowaheritage.org/items/show/64357,"Answers for the 80's","Press|United States|Men|1980-1990|Media influence|Issues|Podiums|Microphones|Signs|Speeches",,"Duffy, Brian, 1955-",,"University of Iowa. Libraries. Special Collections Dept.",1986-01-13|2011-04,,"Educational use only, no other permissions given. Copyright to this digital object is owned by The Des Moines Register; it may not be downloaded, reproduced, or distributed without written permission. For more information, contact the Special Collections Department.","Editorial Cartoons of Brian Duffy; Des Moines Register Cartoonists|Papers of Brian Duffy|Des Moines Register",,English,"Still image|Editorial cartoons",MSC916|duffy-860113|http://digital.lib.uiowa.edu/cdm/ref/collection/duffy/id/195,,,,,,,,,,,,,,,,,,,,,,,,,,,,,,,,,,,,,,,,,,,,,,,,"<a href=""http://digital.lib.uiowa.edu/cdm/ref/collection/duffy/id/195"" target=""_blank"">View this item in its source respository</a>",,,,,,,,,,,,,,,,,,,,,,,,,,,,,http://www.iowaheritage.org/files/original/425445141a0c2e8d1e872ab762bba04b.jpg,"Remote Item","Editorial Cartoons of Brian Duffy",1,0
64480,http://www.iowaheritage.org/items/show/64480,"Anti-government extremists","Domestic violence|Oklahoma City (Okla.)|Oklahoma City Federal Building Bombing, Oklahoma City, Okla., 1995|Rocks|1990-2000|Terrorism|Violence|Bombing|Bombs|Federal government|Hatred|Government, Resistance to|Government|Eyes|Hiding|Buildings|Bomb craters|Footprints",,"Duffy, Brian, 1955-",,"University of Iowa. Libraries. Special Collections Dept.",1995-04-25|2011-04,,"Educational use only, no other permissions given. Copyright to this digital object is owned by The Des Moines Register; it may not be downloaded, reproduced, or distributed without written permission. For more information, contact the Special Collections Department.","Editorial Cartoons of Brian Duffy; Des Moines Register Cartoonists|Papers of Brian Duffy|Des Moines Register",,English,"Still image|Editorial cartoons",MSC916|duffy-950425|http://digital.lib.uiowa.edu/cdm/ref/collection/duffy/id/318,,,,,,,,,,,,,,,,,,,,,,,,,,,,,,,,,,,,,,,,,,,,,,,,"<a href=""http://digital.lib.uiowa.edu/cdm/ref/collection/duffy/id/318"" target=""_blank"">View this item in its source respository</a>",,,,,,,,,,,,,,,,,,,,,,,,,,,,,http://www.iowaheritage.org/files/original/44687a70e5eeabe238208ebe9e5594a6.jpg,"Remote Item","Editorial Cartoons of Brian Duffy",1,0
64491,http://www.iowaheritage.org/items/show/64491,"Anti-tobacco legislation","Legislation|Miller, Tom|Iowa|Doors|1990-2000|Legislature|Lawyers|State governments|State politics|States|Tobacco|Des Moines (Iowa)|Men|Lawyers|Cigarettes|Signs","Attorney general Miller; Thunk; Legislature; Closed come back in January","Duffy, Brian, 1955-",,"University of Iowa. Libraries. Special Collections Dept.",1997-09-21|2011-04,,"Educational use only, no other permissions given. Copyright to this digital object is owned by The Des Moines Register; it may not be downloaded, reproduced, or distributed without written permission. For more information, contact the Special Collections Department.","Editorial Cartoons of Brian Duffy; Des Moines Register Cartoonists|Papers of Brian Duffy|Des Moines Register",,English,"Still image|Editorial cartoons",MSC916|duffy-970921|http://digital.lib.uiowa.edu/cdm/ref/collection/duffy/id/329,,,,,,,,,,,,,,,,,,,,,,,,,,,,,,,,,,,,,,,,,,,,,,,,"<a href=""http://digital.lib.uiowa.edu/cdm/ref/collection/duffy/id/329"" target=""_blank"">View this item in its source respository</a>",,,,,,,,,,,,,,,,,,,,,,,,,,,,,http://www.iowaheritage.org/files/original/8556934164d042848d0d112ce5497dc4.jpg,"Remote Item","Editorial Cartoons of Brian Duffy",1,0
64628,http://www.iowaheritage.org/items/show/64628,"Anybody seen my ball?","War|Bush, George, 1924-|Iraq|Operation Desert Shield, 1990-1991|Presidents|1990-2000|Presidents|Leisure|Sun|Sweating|Deserts|Gas masks|Forts & fortifications|Flags|Guns|Camels|Golf|Golfers|Golf balls|Golf ball hunts|Soldiers|Soldiers, American",Water,"Duffy, Brian, 1955-",,"University of Iowa. Libraries. Special Collections Dept.",1990-08-24|2011-04,,"Educational use only, no other permissions given. Copyright to this digital object is owned by The Des Moines Register; it may not be downloaded, reproduced, or distributed without written permission. For more information, contact the Special Collections Department.","Editorial Cartoons of Brian Duffy; Des Moines Register Cartoonists|Papers of Brian Duffy|Des Moines Register",,English,"Still image|Editorial cartoons",MSC916|duffy-900824|http://digital.lib.uiowa.edu/cdm/ref/collection/duffy/id/466,,,,,,,,,,,,,,,,,,,,,,,,,,,,,,,,,,,,,,,,,,,,,,,,"<a href=""http://digital.lib.uiowa.edu/cdm/ref/collection/duffy/id/466"" target=""_blank"">View this item in its source respository</a>",,,,,,,,,,,,,,,,,,,,,,,,,,,,,http://www.iowaheritage.org/files/original/7221139096e97f2ed8b16f1bdb5f6ba9.jpg,"Remote Item","Editorial Cartoons of Brian Duffy",1,0
64287,http://www.iowaheritage.org/items/show/64287,"Arafat's footprints","Palestine|Arafat, Yasir, 1929-2004|Palestine|Footprints|2000-2010|Violence|Peace|Occupation|Foreign relations|Conflict|Israel|Signs|Arrows|Doves|Olive branches",Peace,"Duffy, Brian, 1955-",,"University of Iowa. Libraries. Special Collections Dept.",2004-11-12|2011-04,,"Educational use only, no other permissions given. Copyright to this digital object is owned by The Des Moines Register; it may not be downloaded, reproduced, or distributed without written permission. For more information, contact the Special Collections Department.","Editorial Cartoons of Brian Duffy; Des Moines Register Cartoonists|Papers of Brian Duffy|Des Moines Register",,English,"Still image|Editorial cartoons",MSC916|duffy-041112|http://digital.lib.uiowa.edu/cdm/ref/collection/duffy/id/125,,,,,,,,,,,,,,,,,,,,,,,,,,,,,,,,,,,,,,,,,,,,,,,,"<a href=""http://digital.lib.uiowa.edu/cdm/ref/collection/duffy/id/125"" target=""_blank"">View this item in its source respository</a>",,,,,,,,,,,,,,,,,,,,,,,,,,,,,http://www.iowaheritage.org/files/original/f1380c405a269abd162ab225c8caf2a6.jpg,"Remote Item","Editorial Cartoons of Brian Duffy",1,0
64606,http://www.iowaheritage.org/items/show/64606,"Are those footsteps I hear?","Primaries|Avenson, Donald|Iowa|Men|1990-2000|Politicians|Politics|Campaigning|Campaigns|Governors|States|State governments|Miller, Tom|Running|Races|Sweating","Clomp; Clomp; Womp; Womp; Avenson; Miller","Duffy, Brian, 1955-",,"University of Iowa. Libraries. Special Collections Dept.",1990-03-22|2011-04,,"Educational use only, no other permissions given. Copyright to this digital object is owned by The Des Moines Register; it may not be downloaded, reproduced, or distributed without written permission. For more information, contact the Special Collections Department.","Editorial Cartoons of Brian Duffy; Des Moines Register Cartoonists|Papers of Brian Duffy|Des Moines Register",,English,"Still image|Editorial cartoons",MSC916|duffy-900322|http://digital.lib.uiowa.edu/cdm/ref/collection/duffy/id/444,,,,,,,,,,,,,,,,,,,,,,,,,,,,,,,,,,,,,,,,,,,,,,,,"<a href=""http://digital.lib.uiowa.edu/cdm/ref/collection/duffy/id/444"" target=""_blank"">View this item in its source respository</a>",,,,,,,,,,,,,,,,,,,,,,,,,,,,,http://www.iowaheritage.org/files/original/e84ac350f7088714212ca52ada90d80a.jpg,"Remote Item","Editorial Cartoons of Brian Duffy",1,0
