 




﻿"Item Id","Item URI","Dublin Core:Title","Dublin Core:Subject","Dublin Core:Description","Dublin Core:Creator","Dublin Core:Source","Dublin Core:Publisher","Dublin Core:Date","Dublin Core:Contributor","Dublin Core:Rights","Dublin Core:Relation","Dublin Core:Format","Dublin Core:Language","Dublin Core:Type","Dublin Core:Identifier","Dublin Core:Coverage","Item Type Metadata:Text","Item Type Metadata:Interviewer","Item Type Metadata:Interviewee","Item Type Metadata:Location","Item Type Metadata:Transcription","Item Type Metadata:Local URL","Item Type Metadata:Original Format","Item Type Metadata:Physical Dimensions","Item Type Metadata:Duration","Item Type Metadata:Compression","Item Type Metadata:Producer","Item Type Metadata:Director","Item Type Metadata:Bit Rate/Frequency","Item Type Metadata:Time Summary","Item Type Metadata:Email Body","Item Type Metadata:Subject Line","Item Type Metadata:From","Item Type Metadata:To","Item Type Metadata:CC","Item Type Metadata:BCC","Item Type Metadata:Number of Attachments","Item Type Metadata:Standards","Item Type Metadata:Objectives","Item Type Metadata:Materials","Item Type Metadata:Lesson Plan Text","Item Type Metadata:URL","Item Type Metadata:Event Type","Item Type Metadata:Participants","Item Type Metadata:Birth Date","Item Type Metadata:Birthplace","Item Type Metadata:Death Date","Item Type Metadata:Occupation","Item Type Metadata:Biographical Text","Item Type Metadata:Bibliography","Item Type Metadata:Digital Reproduction Information","Item Type Metadata:Repository","Item Type Metadata:Repository Collection","Item Type Metadata:Contact information.","Item Type Metadata:File Name","Item Type Metadata:Notes","Item Type Metadata:Digital item created","Item Type Metadata:Digital item modified","Item Type Metadata:Executive Orders","Item Type Metadata:Record Created","Item Type Metadata:Record Modified","Item Type Metadata:Transcription2","Item Type Metadata:Source URL","Omeka Legacy File:Additional Creator","Omeka Legacy File:Transcriber","Omeka Legacy File:Producer","Omeka Legacy File:Render Device","Omeka Legacy File:Render Details","Omeka Legacy File:Capture Date","Omeka Legacy File:Capture Device","Omeka Legacy File:Capture Details","Omeka Legacy File:Change History","Omeka Legacy File:Watermark","Omeka Legacy File:Encryption","Omeka Legacy File:Compression","Omeka Legacy File:Post Processing","Omeka Image File:Width","Omeka Image File:Height","Omeka Image File:Bit Depth","Omeka Image File:Channels","Omeka Image File:Exif String","Omeka Image File:Exif Array","Omeka Image File:IPTC String","Omeka Image File:IPTC Array","Omeka Video File:Bitrate","Omeka Video File:Duration","Omeka Video File:Sample Rate","Omeka Video File:Codec","Omeka Video File:Width","Omeka Video File:Height",tags,file,itemType,collection,public,featured
11937,http://www.iowaheritage.org/items/show/11937,"University President Sally Mason and University Librarian Nancy L. Baker lead government officials through Main Library, The University of Iowa, June 13, 2008","Floods|Harkin, Tom|University of Iowa|United States -- Iowa -- Iowa City|2000-2010|Evacuations|Disaster relief|Governors|Legislators|College presidents|Librarians|Grassley, Chuck|Loebsack, Dave|Culver, Chet|Mason, Sally|Baker, Nancy L., 1950-|Kraft, Nancy|Main Library (Iowa City, Iowa)","Iowa Governor Chet Culver, United States Senators Tom Harkin and Charles Grassley, and United States Congressman Dave Loebsack tour the Main Library with President Sally Mason and University Librarian Nancy Baker on Friday, June 13, 2008.","Schoon, Tim",,"University of Iowa. University News Services",2008-06-13|2008-06-13,,"Educational use only, no other permissions given. U.S. and international copyright laws may protect this item. Commercial use or distribution of this digital object is not permitted without written permission of the copyright holder.","Iowa City Flood|Flood Images|Dignitary Tour, June 13, 2008",jpeg,,"Still image|Photographs",https://digital.lib.uiowa.edu/,,,,,,,,,,,,,,,,,,,,,,,,,,,,,,,,,,,,,,,,,,,,,,,,"<a href=""https://digital.lib.uiowa.edu/"" target=""_blank"">View this item in its source respository</a>",,,,,,,,,,,,,,,,,,,,,,,,,,,,,http://www.iowaheritage.org/files/original/b2d57eefbce033b40f73b95070c1a55b.jpg,"Remote Item","Iowa City Flood",1,0
12169,http://www.iowaheritage.org/items/show/12169,"University President Sally Mason leads government officials on tour of flooding, The University of Iowa, June 13, 2008","Floods|Harkin, Tom|University of Iowa|United States -- Iowa -- Iowa City|2000-2010|Evacuations|Disaster relief|Governors|Legislators|College presidents|Grassley, Chuck|Loebsack, Dave|Culver, Chet|Mason, Sally","Iowa Governor Chet Culver, United States Senators Tom Harkin and Charles Grassley, and United States Congressman Dave Loebsack survey campus flooding with President Sally Mason on Friday, June 13, 2008.","Schoon, Tim",,"University of Iowa. University News Services",2008-06-13|2008-06-13,,"Educational use only, no other permissions given. U.S. and international copyright laws may protect this item. Commercial use or distribution of this digital object is not permitted without written permission of the copyright holder.","Iowa City Flood|Flood Images|Dignitary Tour, June 13, 2008",jpeg,,"Still image|Photographs",https://digital.lib.uiowa.edu/,,,,,,,,,,,,,,,,,,,,,,,,,,,,,,,,,,,,,,,,,,,,,,,,"<a href=""https://digital.lib.uiowa.edu/"" target=""_blank"">View this item in its source respository</a>",,,,,,,,,,,,,,,,,,,,,,,,,,,,,http://www.iowaheritage.org/files/original/3a332856d63d12f72343aab5909f5c82.jpg,"Remote Item","Iowa City Flood",1,0
12195,http://www.iowaheritage.org/items/show/12195,"University President Sally Mason leads government officials on tour of flooding, The University of Iowa, June 13, 2008","Floods|Harkin, Tom|University of Iowa|United States -- Iowa -- Iowa City|2000-2010|Evacuations|Disaster relief|Governors|Legislators|College presidents|Grassley, Chuck|Loebsack, Dave|Culver, Chet|Mason, Sally","Iowa Governor Chet Culver, United States Senators Tom Harkin and Charles Grassley, and United States Congressman Dave Loebsack survey campus flooding with President Sally Mason on Friday, June 13, 2008.","Schoon, Tim",,"University of Iowa. University News Services",2008-06-13|2008-06-13,,"Educational use only, no other permissions given. U.S. and international copyright laws may protect this item. Commercial use or distribution of this digital object is not permitted without written permission of the copyright holder.","Iowa City Flood|Flood Images|Dignitary Tour, June 13, 2008",jpeg,,"Still image|Photographs",https://digital.lib.uiowa.edu/,,,,,,,,,,,,,,,,,,,,,,,,,,,,,,,,,,,,,,,,,,,,,,,,"<a href=""https://digital.lib.uiowa.edu/"" target=""_blank"">View this item in its source respository</a>",,,,,,,,,,,,,,,,,,,,,,,,,,,,,http://www.iowaheritage.org/files/original/e3920b7253410d02b54357dee6e87caf.jpg,"Remote Item","Iowa City Flood",1,0
12212,http://www.iowaheritage.org/items/show/12212,"University President Sally Mason leads government officials on tour of flooding, The University of Iowa, June 13, 2008","Floods|Harkin, Tom|University of Iowa|United States -- Iowa -- Iowa City|2000-2010|Evacuations|Disaster relief|Governors|Legislators|College presidents|Grassley, Chuck|Loebsack, Dave|Culver, Chet|Mason, Sally","Iowa Governor Chet Culver, United States Senators Tom Harkin and Charles Grassley, and United States Congressman Dave Loebsack survey campus flooding with President Sally Mason on Friday, June 13, 2008.","Schoon, Tim",,"University of Iowa. University News Services",2008-06-13|2008-06-13,,"Educational use only, no other permissions given. U.S. and international copyright laws may protect this item. Commercial use or distribution of this digital object is not permitted without written permission of the copyright holder.","Iowa City Flood|Flood Images|Dignitary Tour, June 13, 2008",jpeg,,"Still image|Photographs",https://digital.lib.uiowa.edu/,,,,,,,,,,,,,,,,,,,,,,,,,,,,,,,,,,,,,,,,,,,,,,,,"<a href=""https://digital.lib.uiowa.edu/"" target=""_blank"">View this item in its source respository</a>",,,,,,,,,,,,,,,,,,,,,,,,,,,,,http://www.iowaheritage.org/files/original/841a07797eb3b314b32ede1785f90dbf.jpg,"Remote Item","Iowa City Flood",1,0
12222,http://www.iowaheritage.org/items/show/12222,"University President Sally Mason leads government officials on tour of flooding, The University of Iowa, June 13, 2008","Floods|Harkin, Tom|University of Iowa|United States -- Iowa -- Iowa City|2000-2010|Evacuations|Disaster relief|Governors|Legislators|College presidents|Librarians|Community service|Grassley, Chuck|Loebsack, Dave|Culver, Chet|Mason, Sally|Baker, Nancy L., 1950-","Iowa Governor Chet Culver, United States Senators Tom Harkin and Charles Grassley, and United States Congressman Dave Loebsack survey campus flooding with President Sally Mason and University Librarian Nancy Baker on Friday, June 13, 2008.","Schoon, Tim",,"University of Iowa. University News Services",2008-06-13|2008-06-13,,"Educational use only, no other permissions given. U.S. and international copyright laws may protect this item. Commercial use or distribution of this digital object is not permitted without written permission of the copyright holder.","Iowa City Flood|Flood Images|Dignitary Tour, June 13, 2008",jpeg,,"Still image|Photographs",https://digital.lib.uiowa.edu/,,,,,,,,,,,,,,,,,,,,,,,,,,,,,,,,,,,,,,,,,,,,,,,,"<a href=""https://digital.lib.uiowa.edu/"" target=""_blank"">View this item in its source respository</a>",,,,,,,,,,,,,,,,,,,,,,,,,,,,,http://www.iowaheritage.org/files/original/cf9a2ab404c141f69eb6c935377e65f1.jpg,"Remote Item","Iowa City Flood",1,0
12252,http://www.iowaheritage.org/items/show/12252,"University President Sally Mason leads government officials on tour of flooding, The University of Iowa, June 13, 2008","Floods|Harkin, Tom|University of Iowa|United States -- Iowa -- Iowa City|2000-2010|Evacuations|Disaster relief|Governors|Legislators|College presidents|Librarians|Grassley, Chuck|Loebsack, Dave|Culver, Chet|Mason, Sally|Baker, Nancy L., 1950-","Iowa Governor Chet Culver, United States Senators Tom Harkin and Charles Grassley, and United States Congressman Dave Loebsack survey campus flooding with President Sally Mason and University Librarian Nancy Baker on Friday, June 13, 2008.","Schoon, Tim",,"University of Iowa. University News Services",2008-06-13|2008-06-13,,"Educational use only, no other permissions given. U.S. and international copyright laws may protect this item. Commercial use or distribution of this digital object is not permitted without written permission of the copyright holder.","Iowa City Flood|Flood Images|Dignitary Tour, June 13, 2008",jpeg,,"Still image|Photographs",https://digital.lib.uiowa.edu/,,,,,,,,,,,,,,,,,,,,,,,,,,,,,,,,,,,,,,,,,,,,,,,,"<a href=""https://digital.lib.uiowa.edu/"" target=""_blank"">View this item in its source respository</a>",,,,,,,,,,,,,,,,,,,,,,,,,,,,,http://www.iowaheritage.org/files/original/5a702f2c6e944584721696349c068aea.jpg,"Remote Item","Iowa City Flood",1,0
12411,http://www.iowaheritage.org/items/show/12411,"University President Sally Mason greets government officials for tour of flooding, The University of Iowa, June 13, 2008","Floods|Harkin, Tom|University of Iowa|United States -- Iowa -- Iowa City|2000-2010|Evacuations|Disaster relief|Governors|Legislators|College presidents|Grassley, Chuck|Loebsack, Dave|Culver, Chet|Mason, Sally","Iowa Governor Chet Culver, United States Senators Tom Harkin and Charles Grassley, and United States Congressman Dave Loebsack survey campus flooding with President Sally Mason on Friday, June 13, 2008.","Schoon, Tim",,"University of Iowa. University News Services",2008-06-13|2008-06-13,,"Educational use only, no other permissions given. U.S. and international copyright laws may protect this item. Commercial use or distribution of this digital object is not permitted without written permission of the copyright holder.","Iowa City Flood|Flood Images|Dignitary Tour, June 13, 2008",jpeg,,"Still image|Photographs",https://digital.lib.uiowa.edu/,,,,,,,,,,,,,,,,,,,,,,,,,,,,,,,,,,,,,,,,,,,,,,,,"<a href=""https://digital.lib.uiowa.edu/"" target=""_blank"">View this item in its source respository</a>",,,,,,,,,,,,,,,,,,,,,,,,,,,,,http://www.iowaheritage.org/files/original/59cb260ccbd09c51b53ba4e3783a5a8b.jpg,"Remote Item","Iowa City Flood",1,0
16333,http://www.iowaheritage.org/items/show/16333,"Artists Equity Association, 1962-1975","Meetings|Drewelowe, Eve, 1899-1988|Artists Equity Association|United States -- Colorado -- Boulder|1960-1970|Art|Artists|Awards|Exhibitions|Legislators|Health|Chemicals|Forgeries|Business & finance|Insurance|Art dealers|Contracts|United States -- Colorado|1970-1980",,unidentified,,"University of Iowa. Libraries. Iowa Women's Archives",1962|2009-08-11,,"Educational use only, no other permissions given. U.S. and international copyright laws may protect this item. Commercial use or distribution of this digital object is not permitted without written permission of the Iowa Women's Archives and the School of Art and Art History, University of Iowa.","Eve Drewelowe Digital Collection|Eve Drewelowe papers, 1924-1995|http://lib.uiowa.edu/collguides/?IWA0135|Art career|Artists Equity Association",jpeg,,"Text|Newsletters; Awards",IWA035|05|drewe05-06|https://digital.lib.uiowa.edu/,,,,,,,,,,,,,,,,,,,,,,,,,,,,,,,,,,,,,,,,,,,,,,,,"<a href=""https://digital.lib.uiowa.edu/"" target=""_blank"">View this item in its source respository</a>",,,,,,,,,,,,,,,,,,,,,,,,,,,,,http://www.iowaheritage.org/files/original/d8530bb0be54ac80bcfe18454a433cfc.jpg,"Remote Item","Eve Drewelowe Digital Collection",1,0
17521,http://www.iowaheritage.org/items/show/17521,"Wallace gets the lowdown, Chicago, Ill., July 15, 1940","Spouses|Wallace, Henry A. (Henry Agard), 1888-1965|United States -- Illinois -- Chicago|1940-1950|Legislators|Cabinet officers|Conversation|Barkley, Alben William, 1877-1956|Barkley, Dorothy Brower",,unidentified,,"University of Iowa. Libraries. Special Collections Dept.",1940-07-15|2010-02-01,,"Educational use only, no other permissions given. U.S. and international copyright laws may protect this item. Commercial use or distribution of this digital object is not permitted without written permission of the University of Iowa Special Collections Dept.","Henry A. Wallace Collection|Henry Agard Wallace papers|http://lib.uiowa.edu/collguides/?MSC0177|Photographs & images|Press Photographs - 7 x 9s|Scanned with Ricoh 3228C scanner at 300 ppi. Archival tiff available.",jpeg,,"Still image|Photographs",MSC0177|7|12|wal-032.jpg|https://digital.lib.uiowa.edu/,,,,,,,,,,,,,,,,,,,,,,,,,,,,,,,,,,,,,,,,,,,,,,,,"<a href=""https://digital.lib.uiowa.edu/"" target=""_blank"">View this item in its source respository</a>",,,,,,,,,,,,,,,,,,,,,,,,,,,,,http://www.iowaheritage.org/files/original/7eb55e438414da50e658fd0e7fa8e4f6.jpg,"Remote Item","Henry A. Wallace Collection",1,0
68504,http://www.iowaheritage.org/items/show/68504,"Professional Women's League of Des Moines documents, 1925-1935","Women's suffrage|Page, Eva|Western Union Telegraph Company|United States -- Iowa -- Des Moines|1920-1930|1930-1940|Drake University|Professional Women's League (Des Moines, Iowa)|Wallace, Josephine|McLoney, Ella M.|Ashby, Harriet Wallace|Safford, Mary|Fuchs, Adele|Brookhart, Smith Wildman, 1869-1944|Steck, Daniel Frederic, 1881-1950||Political participation|Politics & government|Organizations|Women|Legislators|Banquets|Theatrical productions",,unidentified,,"Iowa Women's Archives",19--|2010-10-20,,"Educational use only, no other permissions given. U.S. and International copyright laws may protect this item. Commercial use or distribution of this digital object is not permitted without written permission of the Iowa Women's Archives.","Iowa Women's Suffrage|Professional Women's League, Des Moines, Iowa|http://www.lib.uiowa.edu/collguides/?IWA0110|Program files, papers and plays, 1926-1927",jpeg|28|36,,"Text; Still image|Telegrams; Legal documents; Clippings (information artifacts); Resolutions (administrative records)",IWA0110|index.cpd|http://digital.lib.uiowa.edu/cdm/ref/collection/suffrage/id/1103,,,,,,,,,,,,,,,,,,,,,,,,,,,,,,,,,,,,,,,,,,,,,,,,"<a href=""http://digital.lib.uiowa.edu/cdm/ref/collection/suffrage/id/1103"" target=""_blank"">View this item in its source respository</a>",,,,,,,,,,,,,,,,,,,,,,,,,,,,,http://www.iowaheritage.org/files/original/3baf8c59ca8115909c8e527af6c3a4c3.jpg,"Remote Item",,1,0
