 




﻿"Item Id","Item URI","Dublin Core:Title","Dublin Core:Subject","Dublin Core:Description","Dublin Core:Creator","Dublin Core:Source","Dublin Core:Publisher","Dublin Core:Date","Dublin Core:Contributor","Dublin Core:Rights","Dublin Core:Relation","Dublin Core:Format","Dublin Core:Language","Dublin Core:Type","Dublin Core:Identifier","Dublin Core:Coverage","Item Type Metadata:Text","Item Type Metadata:Interviewer","Item Type Metadata:Interviewee","Item Type Metadata:Location","Item Type Metadata:Transcription","Item Type Metadata:Local URL","Item Type Metadata:Original Format","Item Type Metadata:Physical Dimensions","Item Type Metadata:Duration","Item Type Metadata:Compression","Item Type Metadata:Producer","Item Type Metadata:Director","Item Type Metadata:Bit Rate/Frequency","Item Type Metadata:Time Summary","Item Type Metadata:Email Body","Item Type Metadata:Subject Line","Item Type Metadata:From","Item Type Metadata:To","Item Type Metadata:CC","Item Type Metadata:BCC","Item Type Metadata:Number of Attachments","Item Type Metadata:Standards","Item Type Metadata:Objectives","Item Type Metadata:Materials","Item Type Metadata:Lesson Plan Text","Item Type Metadata:URL","Item Type Metadata:Event Type","Item Type Metadata:Participants","Item Type Metadata:Birth Date","Item Type Metadata:Birthplace","Item Type Metadata:Death Date","Item Type Metadata:Occupation","Item Type Metadata:Biographical Text","Item Type Metadata:Bibliography","Item Type Metadata:Digital Reproduction Information","Item Type Metadata:Repository","Item Type Metadata:Repository Collection","Item Type Metadata:Contact information.","Item Type Metadata:File Name","Item Type Metadata:Notes","Item Type Metadata:Digital item created","Item Type Metadata:Digital item modified","Item Type Metadata:Executive Orders","Item Type Metadata:Record Created","Item Type Metadata:Record Modified","Item Type Metadata:Transcription2","Item Type Metadata:Source URL","Omeka Legacy File:Additional Creator","Omeka Legacy File:Transcriber","Omeka Legacy File:Producer","Omeka Legacy File:Render Device","Omeka Legacy File:Render Details","Omeka Legacy File:Capture Date","Omeka Legacy File:Capture Device","Omeka Legacy File:Capture Details","Omeka Legacy File:Change History","Omeka Legacy File:Watermark","Omeka Legacy File:Encryption","Omeka Legacy File:Compression","Omeka Legacy File:Post Processing","Omeka Image File:Width","Omeka Image File:Height","Omeka Image File:Bit Depth","Omeka Image File:Channels","Omeka Image File:Exif String","Omeka Image File:Exif Array","Omeka Image File:IPTC String","Omeka Image File:IPTC Array","Omeka Video File:Bitrate","Omeka Video File:Duration","Omeka Video File:Sample Rate","Omeka Video File:Codec","Omeka Video File:Width","Omeka Video File:Height",tags,file,itemType,collection,public,featured
19527,http://www.iowaheritage.org/items/show/19527,"Canoes on Iowa River, Iowa City, Iowa, 1919","Canoes|United States -- Iowa -- Iowa City|1910-1920|Rivers|People|United States -- Iowa -- Iowa River","Location possibly near City Park.","Kent, Frederick W. (Frederick Wallace), 1894-1984",,"University of Iowa. Libraries. University Archives",1919|2006-06-28,,"Educational use only, no other permissions given. U.S. and international copyright laws may protect this digital object. Commercial use or distribution of the object is not permitted without prior permission of the copyright holder.","Iowa City Town and Campus Scenes|Frederick W. Kent Collection of Photographs, 1866-2000|http://www.lib.uiowa.edu/collguides/?RG30.0001.01|Prints|Scenes -- Iowa City|River scenes|River scenes|Scanned with Ricoh Aficio 3228C @ 300 ppi. Master image saved in TIFF format.",9|14,,"Still image|Photographs|jpeg",RG30.0001.01|0043|river043.jpg|168413524|https://digital.lib.uiowa.edu/,,,,,,,,,,,,,,,,,,,,,,,,,,,,,,,,,,,,,,,,,,,,,,,,"<a href=""https://digital.lib.uiowa.edu/"" target=""_blank"">View this item in its source respository</a>",,,,,,,,,,,,,,,,,,,,,,,,,,,,,http://www.iowaheritage.org/files/original/f41ea30e9c966dea3213a7d9aebfc65f.jpg,"Remote Item","Iowa City Town and Campus Scenes",1,0
20042,http://www.iowaheritage.org/items/show/20042,"Canoes on Iowa River, Iowa City, Iowa, July 25, 1919","Canoes|United States -- Iowa -- Iowa City|1910-1920|Bridges|Rivers|United States -- Iowa -- Iowa River",,"Kent, Frederick W. (Frederick Wallace), 1894-1984",,"University of Iowa. Libraries. University Archives",1919-07-25|2006-06-30,,"Educational use only, no other permissions given. U.S. and international copyright laws may protect this digital object. Commercial use or distribution of the object is not permitted without prior permission of the copyright holder.","Iowa City Town and Campus Scenes|Frederick W. Kent Collection of Photographs, 1866-2000|http://www.lib.uiowa.edu/collguides/?RG30.0001.01|Prints|Scenes -- Iowa City|River scenes|River scenes|Scanned with Ricoh Aficio 3228C @ 300 ppi. Master image saved in TIFF format.",19|25,,"Still image|Photographs|jpeg",RG30.0001.01|0038|2river037.jpg|168413524|https://digital.lib.uiowa.edu/,,,,,,,,,,,,,,,,,,,,,,,,,,,,,,,,,,,,,,,,,,,,,,,,"<a href=""https://digital.lib.uiowa.edu/"" target=""_blank"">View this item in its source respository</a>",,,,,,,,,,,,,,,,,,,,,,,,,,,,,http://www.iowaheritage.org/files/original/27235adab4d7e56a71250f4c125d2092.jpg,"Remote Item","Iowa City Town and Campus Scenes",1,0
17991,http://www.iowaheritage.org/items/show/17991,"Canoes on the Iowa River, The University of Iowa, January 1940","Women|University of Iowa. Dept. of Physical Education for Women|United States -- Iowa -- Iowa City|1940-1950|Students|Universities & colleges|Canoes|Canoeists (Sports)|University of Iowa. Dept. of Health and Sport Studies",,unknown,,"Henry Louis Rexall & Kodak Store|University of Iowa. Libraries. Iowa Women's Archives",1940-01|2008-03-20,,"Educational use only, no other permissions given. U.S. and international copyright laws may protect this item. Commercial use or distribution of this digital object is not permitted without written permission of the Iowa Women's Archives.","University of Iowa Physical Education for Women|The University of Iowa Department of Physical Education for Women Records, 1900-2006|http://www.lib.uiowa.edu/collguides/?IWA0106|Canoeing",jpeg|8|11,,"Still image|Photographs",IWA0106|uipe0057.jpg|https://digital.lib.uiowa.edu/,,,,,,,,,,,,,,,,,,,,,,,,,,,,,,,,,,,,,,,,,,,,,,,,"<a href=""https://digital.lib.uiowa.edu/"" target=""_blank"">View this item in its source respository</a>",,,,,,,,,,,,,,,,,,,,,,,,,,,,,http://www.iowaheritage.org/files/original/abc2f88b8473884ec357d2bea0f87063.jpg,"Remote Item","University of Iowa Physical Education for Women",1,0
17964,http://www.iowaheritage.org/items/show/17964,"Canoing at  Marjory Camp, The University of Iowa, 1930s","Women|University of Iowa. Dept. of Physical Education for Women|United States -- Iowa -- Iowa City|1930-1940|Students|Universities & colleges|Canoes|Canoeists (Sports)|University of Iowa. Dept. of Health and Sport Studies",,unknown,,"University of Iowa. Libraries. Iowa Women's Archives",1930/1939|2008-03-20,,"Educational use only, no other permissions given. U.S. and international copyright laws may protect this item. Commercial use or distribution of this digital object is not permitted without written permission of the Iowa Women's Archives.","University of Iowa Physical Education for Women|The University of Iowa Department of Physical Education for Women Records, 1900-2006|http://www.lib.uiowa.edu/collguides/?IWA0106|Canoeing",jpeg|11|16,,"Still image|Photographs",IWA0106|uipe0068.jpg|https://digital.lib.uiowa.edu/,,,,,,,,,,,,,,,,,,,,,,,,,,,,,,,,,,,,,,,,,,,,,,,,"<a href=""https://digital.lib.uiowa.edu/"" target=""_blank"">View this item in its source respository</a>",,,,,,,,,,,,,,,,,,,,,,,,,,,,,http://www.iowaheritage.org/files/original/5631feec380da6caeaee702f09b35024.jpg,"Remote Item","University of Iowa Physical Education for Women",1,0
18002,http://www.iowaheritage.org/items/show/18002,"Choosing a paddle, The University of Iowa, 1930s","Women|University of Iowa. Dept. of Physical Education for Women|United States -- Iowa -- Iowa City|1930-1940|Students|Universities & colleges|Canoes|Canoeists (Sports)|University of Iowa. Dept. of Health and Sport Studies",,unknown,,"University of Iowa. Libraries. Iowa Women's Archives",1930/1939|2008-03-20,,"Educational use only, no other permissions given. U.S. and international copyright laws may protect this item. Commercial use or distribution of this digital object is not permitted without written permission of the Iowa Women's Archives.","University of Iowa Physical Education for Women|The University of Iowa Department of Physical Education for Women Records, 1900-2006|http://www.lib.uiowa.edu/collguides/?IWA0106|Canoeing",jpeg|11|17,,"Still image|Photographs",IWA0106|uipe0047.jpg|https://digital.lib.uiowa.edu/,,,,,,,,,,,,,,,,,,,,,,,,,,,,,,,,,,,,,,,,,,,,,,,,"<a href=""https://digital.lib.uiowa.edu/"" target=""_blank"">View this item in its source respository</a>",,,,,,,,,,,,,,,,,,,,,,,,,,,,,http://www.iowaheritage.org/files/original/c5f0426c06a240ca4a624ee8d37c499d.jpg,"Remote Item","University of Iowa Physical Education for Women",1,0
19155,http://www.iowaheritage.org/items/show/19155,"City Park pond and canoe, Iowa City, Iowa, between 1915 and 1920","Parks|City Park (Iowa City, Iowa)|United States -- Iowa -- Iowa City|1910-1920|Lakes & ponds|Canoes",,"Kent, Frederick W. (Frederick Wallace), 1894-1984",,"University of Iowa. Libraries. University Archives",1915/1920|2006-06-23,,"Educational use only, no other permissions given. U.S. and international copyright laws may protect this digital object. Commercial use or distribution of the object is not permitted without prior permission of the copyright holder.","Iowa City Town and Campus Scenes|Frederick W. Kent Collection of Photographs, 1866-2000|http://www.lib.uiowa.edu/collguides/?RG30.0001.01|Prints|Scenes -- Iowa City|City Park|City Park|Scanned with Ricoh Aficio 3228C @ 300 ppi. Master image saved in TIFF format.",13|18,,"Still image|Photographs|jpeg",RG30.0001.01|0007|park007.jpg|168413524|https://digital.lib.uiowa.edu/,,,,,,,,,,,,,,,,,,,,,,,,,,,,,,,,,,,,,,,,,,,,,,,,"<a href=""https://digital.lib.uiowa.edu/"" target=""_blank"">View this item in its source respository</a>",,,,,,,,,,,,,,,,,,,,,,,,,,,,,http://www.iowaheritage.org/files/original/ed57a39ad8e09e1b53fad81deea4ca70.jpg,"Remote Item","Iowa City Town and Campus Scenes",1,0
17988,http://www.iowaheritage.org/items/show/17988,"Eighteen-foot guide canoes, The University of Iowa, 1930s","Women|University of Iowa. Dept. of Physical Education for Women|United States -- Iowa -- Iowa City|1930-1940|Students|Universities & colleges|Canoes|Canoeists (Sports)|University of Iowa. Dept. of Health and Sport Studies",,unknown,,"University of Iowa. Libraries. Iowa Women's Archives",1930/1939|2008-03-20,,"Educational use only, no other permissions given. U.S. and international copyright laws may protect this item. Commercial use or distribution of this digital object is not permitted without written permission of the Iowa Women's Archives.","University of Iowa Physical Education for Women|The University of Iowa Department of Physical Education for Women Records, 1900-2006|http://www.lib.uiowa.edu/collguides/?IWA0106|Canoeing",jpeg|11|16,,"Still image|Photographs",IWA0106|uipe0061.jpg|https://digital.lib.uiowa.edu/,,,,,,,,,,,,,,,,,,,,,,,,,,,,,,,,,,,,,,,,,,,,,,,,"<a href=""https://digital.lib.uiowa.edu/"" target=""_blank"">View this item in its source respository</a>",,,,,,,,,,,,,,,,,,,,,,,,,,,,,http://www.iowaheritage.org/files/original/9c1bad8fe103e206d89e5f5a75693677.jpg,"Remote Item","University of Iowa Physical Education for Women",1,0
20036,http://www.iowaheritage.org/items/show/20036,"Fitzgerald's canoe dock, The University of Iowa, May 1948","Canoes|United States -- Iowa -- Iowa City|1940-1950|Rivers|United States -- Iowa -- Iowa River","View looking northwest on Iowa River. Art Building in background.","Kent, Frederick W. (Frederick Wallace), 1894-1984",,"The University of Iowa. Libraries. University Archives",1948-05|2006-06-30,,"Educational use only, no other permissions given. U.S. and international copyright laws may protect this digital object. Commercial use or distribution of the object is not permitted without prior permission of the copyright holder.","Iowa City Town and Campus Scenes|Frederick W. Kent Collection of Photographs, 1866-2000|http://www.lib.uiowa.edu/collguides/?RG30.0001.01|Prints|Scenes -- Iowa City|River scenes|River scenes|Scanned with Ricoh Aficio 3228C @ 300 ppi. Master image saved in TIFF format.",6|6,,"Still image|Photographs|jpeg",RG30.0001.01|036|2river035.jpg|168413524|https://digital.lib.uiowa.edu/,,,,,,,,,,,,,,,,,,,,,,,,,,,,,,,,,,,,,,,,,,,,,,,,"<a href=""https://digital.lib.uiowa.edu/"" target=""_blank"">View this item in its source respository</a>",,,,,,,,,,,,,,,,,,,,,,,,,,,,,http://www.iowaheritage.org/files/original/05b3fdd130e4d8c87067291136fadc1e.jpg,"Remote Item","Iowa City Town and Campus Scenes",1,0
12357,http://www.iowaheritage.org/items/show/12357,"Inside Iowa Advanced Technology Laboratories after flooding, The University of Iowa, June 19, 2008","Floods|University of Iowa|United States -- Iowa -- Iowa City|2000-2010|Evacuations|Disaster relief|Canoes|Educational facilities|University of Iowa. Museum of Art","Inside the Iowa Advanced Technology Laboratories and Iowa Memorial Union on Thursday, June 19, 2008.","Schoon, Tim",,"University of Iowa. University News Services",2008-06-19|2008-06-19,,"Educational use only, no other permissions given. U.S. and international copyright laws may protect this item. Commercial use or distribution of this digital object is not permitted without written permission of the copyright holder.","Iowa City Flood|Flood Images|Flood, June 19, 2008",jpeg,,"Still image|Photographs",https://digital.lib.uiowa.edu/,,,,,,,,,,,,,,,,,,,,,,,,,,,,,,,,,,,,,,,,,,,,,,,,"<a href=""https://digital.lib.uiowa.edu/"" target=""_blank"">View this item in its source respository</a>",,,,,,,,,,,,,,,,,,,,,,,,,,,,,http://www.iowaheritage.org/files/original/e02b4ac6abac25f2e128b1765b5a0312.jpg,"Remote Item","Iowa City Flood",1,0
19485,http://www.iowaheritage.org/items/show/19485,"Iowa River, man rowing canoe, Iowa City, Iowa, between 1915 and 1920","Canoes|United States -- Iowa -- Iowa City|1910-1920|Rivers|Men|United States -- Iowa -- Iowa River",,"Kent, Frederick W. (Frederick Wallace), 1894-1984",,"University of Iowa. Libraries. University Archives",1915/1920|2006-06-28,,"Educational use only, no other permissions given. U.S. and international copyright laws may protect this digital object. Commercial use or distribution of the object is not permitted without prior permission of the copyright holder.","Iowa City Town and Campus Scenes|Frederick W. Kent Collection of Photographs, 1866-2000|http://www.lib.uiowa.edu/collguides/?RG30.0001.01|Prints|Scenes -- Iowa City|River scenes|River scenes|Scanned with Ricoh Aficio 3228C @ 300 ppi. Master image saved in TIFF format.",13|8,,"Still image|Photographs|jpeg",RG30.0001.01|0029|river029.jpg|168413524|https://digital.lib.uiowa.edu/,,,,,,,,,,,,,,,,,,,,,,,,,,,,,,,,,,,,,,,,,,,,,,,,"<a href=""https://digital.lib.uiowa.edu/"" target=""_blank"">View this item in its source respository</a>",,,,,,,,,,,,,,,,,,,,,,,,,,,,,http://www.iowaheritage.org/files/original/51e0d1b5d55ac3e3e5f529d3c96890e0.jpg,"Remote Item","Iowa City Town and Campus Scenes",1,0
