 




﻿"Item Id","Item URI","Dublin Core:Title","Dublin Core:Subject","Dublin Core:Description","Dublin Core:Creator","Dublin Core:Source","Dublin Core:Publisher","Dublin Core:Date","Dublin Core:Contributor","Dublin Core:Rights","Dublin Core:Relation","Dublin Core:Format","Dublin Core:Language","Dublin Core:Type","Dublin Core:Identifier","Dublin Core:Coverage","Item Type Metadata:Text","Item Type Metadata:Interviewer","Item Type Metadata:Interviewee","Item Type Metadata:Location","Item Type Metadata:Transcription","Item Type Metadata:Local URL","Item Type Metadata:Original Format","Item Type Metadata:Physical Dimensions","Item Type Metadata:Duration","Item Type Metadata:Compression","Item Type Metadata:Producer","Item Type Metadata:Director","Item Type Metadata:Bit Rate/Frequency","Item Type Metadata:Time Summary","Item Type Metadata:Email Body","Item Type Metadata:Subject Line","Item Type Metadata:From","Item Type Metadata:To","Item Type Metadata:CC","Item Type Metadata:BCC","Item Type Metadata:Number of Attachments","Item Type Metadata:Standards","Item Type Metadata:Objectives","Item Type Metadata:Materials","Item Type Metadata:Lesson Plan Text","Item Type Metadata:URL","Item Type Metadata:Event Type","Item Type Metadata:Participants","Item Type Metadata:Birth Date","Item Type Metadata:Birthplace","Item Type Metadata:Death Date","Item Type Metadata:Occupation","Item Type Metadata:Biographical Text","Item Type Metadata:Bibliography","Item Type Metadata:Digital Reproduction Information","Item Type Metadata:Repository","Item Type Metadata:Repository Collection","Item Type Metadata:Contact information.","Item Type Metadata:File Name","Item Type Metadata:Notes","Item Type Metadata:Digital item created","Item Type Metadata:Digital item modified","Item Type Metadata:Executive Orders","Item Type Metadata:Record Created","Item Type Metadata:Record Modified","Item Type Metadata:Transcription2","Item Type Metadata:Source URL","Omeka Legacy File:Additional Creator","Omeka Legacy File:Transcriber","Omeka Legacy File:Producer","Omeka Legacy File:Render Device","Omeka Legacy File:Render Details","Omeka Legacy File:Capture Date","Omeka Legacy File:Capture Device","Omeka Legacy File:Capture Details","Omeka Legacy File:Change History","Omeka Legacy File:Watermark","Omeka Legacy File:Encryption","Omeka Legacy File:Compression","Omeka Legacy File:Post Processing","Omeka Image File:Width","Omeka Image File:Height","Omeka Image File:Bit Depth","Omeka Image File:Channels","Omeka Image File:Exif String","Omeka Image File:Exif Array","Omeka Image File:IPTC String","Omeka Image File:IPTC Array","Omeka Video File:Bitrate","Omeka Video File:Duration","Omeka Video File:Sample Rate","Omeka Video File:Codec","Omeka Video File:Width","Omeka Video File:Height",tags,file,itemType,collection,public,featured
23218,http://www.iowaheritage.org/items/show/23218,"Women in Greek costume dancing on the Pentacrest lawn, The University of Iowa, 1920","Universities & colleges|University of Iowa|United States -- Iowa -- Iowa City|1920-1930|Dance|Costumes|Audiences|Theatrical productions",,"Kent, Frederick W. (Frederick Wallace), 1894-1984",,"University of Iowa. Libraries. University Archives",1920|2008-05,,"Educational use only, no other permissions given. U.S. and international copyright laws may protect this digital object. Commercial use or distribution of the object is not permitted without prior permission of the copyright holder.","Iowa City Town and Campus Scenes|Frederick W. Kent Collection of Photographs, 1866-2000|http://www.lib.uiowa.edu/collguides/?RG30.0001.01|Prints|Events and activities|Fetes|Fetes|Scanned with Ricoh Aficio 3228C @ 300 ppi, full color. Master images saved in tiff format.",9|14,,"Still image|Photographs; Postcards|jpeg",RG30.0001.01|https://digital.lib.uiowa.edu/,,,,,,,,,,,,,,,,,,,,,,,,,,,,,,,,,,,,,,,,,,,,,,,,"<a href=""https://digital.lib.uiowa.edu/"" target=""_blank"">View this item in its source respository</a>",,,,,,,,,,,,,,,,,,,,,,,,,,,,,http://www.iowaheritage.org/files/original/f195e5618d397bc938ca43004be6651f.jpg,"Remote Item","Iowa City Town and Campus Scenes",1,0
23224,http://www.iowaheritage.org/items/show/23224,"Women in Greek costume dancing on the Pentacrest lawn, The University of Iowa, 1920","Universities & colleges|University of Iowa|United States -- Iowa -- Iowa City|1920-1930|Dance|Costumes|Audiences|Theatrical productions",,"Kent, Frederick W. (Frederick Wallace), 1894-1984",,"University of Iowa. Libraries. University Archives",1920|2008-05,,"Educational use only, no other permissions given. U.S. and international copyright laws may protect this digital object. Commercial use or distribution of the object is not permitted without prior permission of the copyright holder.","Iowa City Town and Campus Scenes|Frederick W. Kent Collection of Photographs, 1866-2000|http://www.lib.uiowa.edu/collguides/?RG30.0001.01|Prints|Events and activities|Fetes|Fetes|Scanned with Ricoh Aficio 3228C @ 300 ppi, full color. Master images saved in tiff format.",9|14,,"Still image|Photographs; Postcards|jpeg",RG30.0001.01|https://digital.lib.uiowa.edu/,,,,,,,,,,,,,,,,,,,,,,,,,,,,,,,,,,,,,,,,,,,,,,,,"<a href=""https://digital.lib.uiowa.edu/"" target=""_blank"">View this item in its source respository</a>",,,,,,,,,,,,,,,,,,,,,,,,,,,,,http://www.iowaheritage.org/files/original/ae934c994d7afbc514cbe9b8269f5628.jpg,"Remote Item","Iowa City Town and Campus Scenes",1,0
23230,http://www.iowaheritage.org/items/show/23230,"Women in costume dancing with a maypole on the Pentacrest lawn, The University of Iowa, June 1924","Universities & colleges|University of Iowa|United States -- Iowa -- Iowa City|1920-1930|Dance|Costumes|May poles|Audiences",,"Kent, Frederick W. (Frederick Wallace), 1894-1984",,"University of Iowa. Libraries. University Archives",1924-06|2008-05,,"Educational use only, no other permissions given. U.S. and international copyright laws may protect this digital object. Commercial use or distribution of the object is not permitted without prior permission of the copyright holder.","Iowa City Town and Campus Scenes|Frederick W. Kent Collection of Photographs, 1866-2000|http://www.lib.uiowa.edu/collguides/?RG30.0001.01|Prints|Events and activities|Fetes|Fetes|Scanned with Ricoh Aficio 3228C @ 300 ppi, full color. Master images saved in tiff format.",8|15,,"Still image|Photographs|jpeg",RG30.0001.01|https://digital.lib.uiowa.edu/,,,,,,,,,,,,,,,,,,,,,,,,,,,,,,,,,,,,,,,,,,,,,,,,"<a href=""https://digital.lib.uiowa.edu/"" target=""_blank"">View this item in its source respository</a>",,,,,,,,,,,,,,,,,,,,,,,,,,,,,http://www.iowaheritage.org/files/original/cd7ce6c63dd98869092da03906eec8d3.jpg,"Remote Item","Iowa City Town and Campus Scenes",1,0
23236,http://www.iowaheritage.org/items/show/23236,"Women in Greek costume dancing on the Pentacrest lawn, The University of Iowa, 1920","Universities & colleges|University of Iowa|United States -- Iowa -- Iowa City|1920-1930|Dance|Costumes|Audiences|Theatrical productions",,"Kent, Frederick W. (Frederick Wallace), 1894-1984",,"University of Iowa. Libraries. University Archives",1920|2008-05,,"Educational use only, no other permissions given. U.S. and international copyright laws may protect this digital object. Commercial use or distribution of the object is not permitted without prior permission of the copyright holder.","Iowa City Town and Campus Scenes|Frederick W. Kent Collection of Photographs, 1866-2000|http://www.lib.uiowa.edu/collguides/?RG30.0001.01|Prints|Events and activities|Fetes|Fetes|Scanned with Ricoh Aficio 3228C @ 300 ppi, full color. Master images saved in tiff format.",9|14,,"Still image|Photographs; Postcards|jpeg",RG30.0001.01|https://digital.lib.uiowa.edu/,,,,,,,,,,,,,,,,,,,,,,,,,,,,,,,,,,,,,,,,,,,,,,,,"<a href=""https://digital.lib.uiowa.edu/"" target=""_blank"">View this item in its source respository</a>",,,,,,,,,,,,,,,,,,,,,,,,,,,,,http://www.iowaheritage.org/files/original/5b2dc7911f53e108b10f268f99c851e8.jpg,"Remote Item","Iowa City Town and Campus Scenes",1,0
23256,http://www.iowaheritage.org/items/show/23256,"Speech on west portico of Old Capitol, The University of Iowa, 1920s?","Crowds|University of Iowa|United States -- Iowa -- Iowa City|1920-1930|Audiences|Public speaking|Universities & colleges|Jessup Hall (Iowa City, Iowa)|Old North Hall (Iowa City, Iowa)|Old Dental Building (Iowa City, Iowa)|Old Capitol (Iowa City, Iowa)","Jessup Hall is on left, and two brick buildings in center are Old Dental Building (left) and Old North Hall.","Kent, Frederick W. (Frederick Wallace), 1894-1984",,"University of Iowa. Libraries. University Archives",1920/1929|2008-05,,"Educational use only, no other permissions given. U.S. and international copyright laws may protect this digital object. Commercial use or distribution of the object is not permitted without prior permission of the copyright holder.","Iowa City Town and Campus Scenes|Frederick W. Kent Collection of Photographs, 1866-2000|http://www.lib.uiowa.edu/collguides/?RG30.0001.01|Prints|Buildings|Jessup Hall; North Hall; Dental Building (Old); Old Capitol|Jessup Hall; North Hall; Dental Building (Old); Old Capitol|Scanned with Ricoh Aficio 3228C at 600 ppi, full color. Master images saved in tiff format.",13|17,,"Still image|Photographs|jpeg",RG30.0001.01|ea0506.jpg|https://digital.lib.uiowa.edu/,,,,,,,,,,,,,,,,,,,,,,,,,,,,,,,,,,,,,,,,,,,,,,,,"<a href=""https://digital.lib.uiowa.edu/"" target=""_blank"">View this item in its source respository</a>",,,,,,,,,,,,,,,,,,,,,,,,,,,,,http://www.iowaheritage.org/files/original/d66441b0408da30f1bcd4f947cd00c64.jpg,"Remote Item","Iowa City Town and Campus Scenes",1,0
23312,http://www.iowaheritage.org/items/show/23312,"Man speaking on a stage in a stadium at night, The University of Iowa, 1940s","Stadiums|University of Iowa|United States -- Iowa -- Iowa City|1940-1950|Stages (Platforms)|Podiums|Audiences",,"Kent, Frederick W. (Frederick Wallace), 1894-1984",,"University of Iowa. Libraries. University Archives",1940/1949,,"Educational use only, no other permissions given. U.S. and international copyright laws may protect this digital object. Commercial use or distribution of the object is not permitted without prior permission of the copyright holder.","Iowa City Town and Campus Scenes|Frederick W. Kent Collection of Photographs, 1866-2000|http://www.lib.uiowa.edu/collguides/?RG30.0001.01|Prints|Scanned with Ricoh Aficio 3228C @ 300 ppi, full color. Master images saved in tiff format.",13|18,,"Still image|Photographs|jpeg",RG30.0001.01|ea0537.jpg|https://digital.lib.uiowa.edu/,,,,,,,,,,,,,,,,,,,,,,,,,,,,,,,,,,,,,,,,,,,,,,,,"<a href=""https://digital.lib.uiowa.edu/"" target=""_blank"">View this item in its source respository</a>",,,,,,,,,,,,,,,,,,,,,,,,,,,,,http://www.iowaheritage.org/files/original/b5b627ce3ea55cd78f4a79574baaab2e.jpg,"Remote Item","Iowa City Town and Campus Scenes",1,0
23314,http://www.iowaheritage.org/items/show/23314,"Man speaking into microphone on an outdoor stage, The University of Iowa, 1930s","Men|University of Iowa|United States -- Iowa -- Iowa City|1930-1940|Stages (Platforms)|Audiences|Sound equipment & supplies|Flags",,"Kent, Frederick W. (Frederick Wallace), 1894-1984",,"University of Iowa. Libraries. University Archives",1930/1939,,"Educational use only, no other permissions given. U.S. and international copyright laws may protect this digital object. Commercial use or distribution of the object is not permitted without prior permission of the copyright holder.","Iowa City Town and Campus Scenes|Frederick W. Kent Collection of Photographs, 1866-2000|http://www.lib.uiowa.edu/collguides/?RG30.0001.01|Prints|Scanned with Ricoh Aficio 3228C @ 300 ppi, full color. Master images saved in tiff format.",6|6,,"Still image|Photographs|jpeg",RG30.0001.01|ea0538.jpg|https://digital.lib.uiowa.edu/,,,,,,,,,,,,,,,,,,,,,,,,,,,,,,,,,,,,,,,,,,,,,,,,"<a href=""https://digital.lib.uiowa.edu/"" target=""_blank"">View this item in its source respository</a>",,,,,,,,,,,,,,,,,,,,,,,,,,,,,http://www.iowaheritage.org/files/original/b55458aae18d8f4474163b1880c34b4c.jpg,"Remote Item","Iowa City Town and Campus Scenes",1,0
23316,http://www.iowaheritage.org/items/show/23316,"Nighttime ceremony and rally in front of the Old Capitol, The University of Iowa, 1920s","Military parades & ceremonies|University of Iowa|United States -- Iowa -- Iowa City|1920-1930|Military personnel|Oxen|Audiences|Universities & colleges|Capitols|Old Capitol (Iowa City, Iowa)",,"Kent, Frederick W. (Frederick Wallace), 1894-1984",,"University of Iowa. Libraries. University Archives",1920/1929,,"Educational use only, no other permissions given. U.S. and international copyright laws may protect this digital object. Commercial use or distribution of the object is not permitted without prior permission of the copyright holder.","Iowa City Town and Campus Scenes|Frederick W. Kent Collection of Photographs, 1866-2000|http://www.lib.uiowa.edu/collguides/?RG30.0001.01|Prints|Buildings|Old Capitol|Old Capitol|Scanned with Ricoh Aficio 3228C @ 300 ppi, full color. Master images saved in tiff format.",10|16,,"Still image|Photographs|jpeg",RG30.0001.01|ea0540.jpg|https://digital.lib.uiowa.edu/,,,,,,,,,,,,,,,,,,,,,,,,,,,,,,,,,,,,,,,,,,,,,,,,"<a href=""https://digital.lib.uiowa.edu/"" target=""_blank"">View this item in its source respository</a>",,,,,,,,,,,,,,,,,,,,,,,,,,,,,http://www.iowaheritage.org/files/original/054fa14e6b7e7f1ebce282cebb43f8d1.jpg,"Remote Item","Iowa City Town and Campus Scenes",1,0
23321,http://www.iowaheritage.org/items/show/23321,"Crowd listening to a band performance on the steps of the Old Capitol, The University of Iowa, 1930s","Audiences|University of Iowa|United States -- Iowa -- Iowa City|1930-1940|Bands|Music|Musicians|Capitols|Universities & colleges|Old Capitol (Iowa City, Iowa)|Schaeffer Hall (Iowa City, Iowa)",,"Kent, Frederick W. (Frederick Wallace), 1894-1984",,"University of Iowa. Libraries. University Archives",1930/1939,,"Educational use only, no other permissions given. U.S. and international copyright laws may protect this digital object. Commercial use or distribution of the object is not permitted without prior permission of the copyright holder.","Iowa City Town and Campus Scenes|Frederick W. Kent Collection of Photographs, 1866-2000|http://www.lib.uiowa.edu/collguides/?RG30.0001.01|Prints|Buildings|Old Capitol|Old Capitol|Scanned with Ricoh Aficio 3228C @ 300 ppi, full color. Master images saved in tiff format.",11|17,,"Still image|Photographs|jpeg",RG30.0001.01|ea0545.jpg|https://digital.lib.uiowa.edu/,,,,,,,,,,,,,,,,,,,,,,,,,,,,,,,,,,,,,,,,,,,,,,,,"<a href=""https://digital.lib.uiowa.edu/"" target=""_blank"">View this item in its source respository</a>",,,,,,,,,,,,,,,,,,,,,,,,,,,,,http://www.iowaheritage.org/files/original/b11417653f12eeed9b4eb6749157c61e.jpg,"Remote Item","Iowa City Town and Campus Scenes",1,0
23353,http://www.iowaheritage.org/items/show/23353,"Woman in costume dancing outside for audience, The University of Iowa, June 1924","Universities & colleges|University of Iowa|United States -- Iowa -- Iowa City|1920-1930|Dance|Costumes|Audiences",,"Kent, Frederick W. (Frederick Wallace), 1894-1984",,"University of Iowa. Libraries. University Archives",1924-06|2008-05,,"Educational use only, no other permissions given. U.S. and international copyright laws may protect this digital object. Commercial use or distribution of the object is not permitted without prior permission of the copyright holder.","Iowa City Town and Campus Scenes|Frederick W. Kent Collection of Photographs, 1866-2000|http://www.lib.uiowa.edu/collguides/?RG30.0001.01|Prints|Events and activities|Fetes|Fetes|Scanned with Ricoh Aficio 3228C @ 300 ppi, full color. Master images saved in tiff format.",9|14,,"Still image|Photographs; Postcards|jpeg",RG30.0001.01|https://digital.lib.uiowa.edu/,,,,,,,,,,,,,,,,,,,,,,,,,,,,,,,,,,,,,,,,,,,,,,,,"<a href=""https://digital.lib.uiowa.edu/"" target=""_blank"">View this item in its source respository</a>",,,,,,,,,,,,,,,,,,,,,,,,,,,,,http://www.iowaheritage.org/files/original/4ed3c0e4860b5e9894e953dc7701a894.jpg,"Remote Item","Iowa City Town and Campus Scenes",1,0
