 




﻿"Item Id","Item URI","Dublin Core:Title","Dublin Core:Subject","Dublin Core:Description","Dublin Core:Creator","Dublin Core:Source","Dublin Core:Publisher","Dublin Core:Date","Dublin Core:Contributor","Dublin Core:Rights","Dublin Core:Relation","Dublin Core:Format","Dublin Core:Language","Dublin Core:Type","Dublin Core:Identifier","Dublin Core:Coverage","Item Type Metadata:Text","Item Type Metadata:Interviewer","Item Type Metadata:Interviewee","Item Type Metadata:Location","Item Type Metadata:Transcription","Item Type Metadata:Local URL","Item Type Metadata:Original Format","Item Type Metadata:Physical Dimensions","Item Type Metadata:Duration","Item Type Metadata:Compression","Item Type Metadata:Producer","Item Type Metadata:Director","Item Type Metadata:Bit Rate/Frequency","Item Type Metadata:Time Summary","Item Type Metadata:Email Body","Item Type Metadata:Subject Line","Item Type Metadata:From","Item Type Metadata:To","Item Type Metadata:CC","Item Type Metadata:BCC","Item Type Metadata:Number of Attachments","Item Type Metadata:Standards","Item Type Metadata:Objectives","Item Type Metadata:Materials","Item Type Metadata:Lesson Plan Text","Item Type Metadata:URL","Item Type Metadata:Event Type","Item Type Metadata:Participants","Item Type Metadata:Birth Date","Item Type Metadata:Birthplace","Item Type Metadata:Death Date","Item Type Metadata:Occupation","Item Type Metadata:Biographical Text","Item Type Metadata:Bibliography","Item Type Metadata:Digital Reproduction Information","Item Type Metadata:Repository","Item Type Metadata:Repository Collection","Item Type Metadata:Contact information.","Item Type Metadata:File Name","Item Type Metadata:Notes","Item Type Metadata:Digital item created","Item Type Metadata:Digital item modified","Item Type Metadata:Executive Orders","Item Type Metadata:Record Created","Item Type Metadata:Record Modified","Item Type Metadata:Transcription2","Item Type Metadata:Source URL","Omeka Legacy File:Additional Creator","Omeka Legacy File:Transcriber","Omeka Legacy File:Producer","Omeka Legacy File:Render Device","Omeka Legacy File:Render Details","Omeka Legacy File:Capture Date","Omeka Legacy File:Capture Device","Omeka Legacy File:Capture Details","Omeka Legacy File:Change History","Omeka Legacy File:Watermark","Omeka Legacy File:Encryption","Omeka Legacy File:Compression","Omeka Legacy File:Post Processing","Omeka Image File:Width","Omeka Image File:Height","Omeka Image File:Bit Depth","Omeka Image File:Channels","Omeka Image File:Exif String","Omeka Image File:Exif Array","Omeka Image File:IPTC String","Omeka Image File:IPTC Array","Omeka Video File:Bitrate","Omeka Video File:Duration","Omeka Video File:Sample Rate","Omeka Video File:Codec","Omeka Video File:Width","Omeka Video File:Height",tags,file,itemType,collection,public,featured
64651,http://www.iowaheritage.org/items/show/64651,"Largest living organism discovered living in Washinton, D.C.!","Government|United States|Capitol|1990-2000|Government spending|Deficits|Economy|Economic conditions|Washington (D.C.)|White House|Earth|Mushrooms|Newspapers|Newspaper headlines","Daily news; By Tina Toadstool; A massive, mushroom-producing fungus known to feed on dead wood, was discovered underground here recently its size has been estimated at $400,000,000,000 and growing; The fungus appears to be very resilient, having survived numerous Gramm-Rudman cuts; ""Humongous fungus""; Deficit","Duffy, Brian, 1955-",,"University of Iowa. Libraries. Special Collections Dept.",1992-04-03|2011-04,,"Educational use only, no other permissions given. Copyright to this digital object is owned by The Des Moines Register; it may not be downloaded, reproduced, or distributed without written permission. For more information, contact the Special Collections Department.","Editorial Cartoons of Brian Duffy; Des Moines Register Cartoonists|Papers of Brian Duffy|Des Moines Register",,English,"Still image|Editorial cartoons",MSC916|duffy-920403|http://digital.lib.uiowa.edu/cdm/ref/collection/duffy/id/489,,,,,,,,,,,,,,,,,,,,,,,,,,,,,,,,,,,,,,,,,,,,,,,,"<a href=""http://digital.lib.uiowa.edu/cdm/ref/collection/duffy/id/489"" target=""_blank"">View this item in its source respository</a>",,,,,,,,,,,,,,,,,,,,,,,,,,,,,http://www.iowaheritage.org/files/original/c90e1f5d1ca1a21f440cc786d3125196.jpg,"Remote Item","Editorial Cartoons of Brian Duffy",1,0
64418,http://www.iowaheritage.org/items/show/64418,"Launch another missile at some civilians in Israel ... also, I want those POW's used as human shields","War|Hussein, Saddam, 1937-2006|Iraq|Iraq-Kuwait Crisis, 1990-1991|Hell|1990-2000|Wars|Dictators|Dictatorships|Civilians|Urban pollution|Casualties|Strategy|Operation Desert Shield, 1990-1991|Dictators|Pitchforks|Flames|Skulls|Maps|Smoke|Horns|Caves|Telephones|Toys|Satan|Stairways","Saddam's underground bunker","Duffy, Brian, 1955-",,"University of Iowa. Libraries. Special Collections Dept.",1991-01-24|2011-04,,"Educational use only, no other permissions given. Copyright to this digital object is owned by The Des Moines Register; it may not be downloaded, reproduced, or distributed without written permission. For more information, contact the Special Collections Department.","Editorial Cartoons of Brian Duffy; Des Moines Register Cartoonists|Papers of Brian Duffy|Des Moines Register",,English,"Still image|Editorial cartoons",MSC916|duffy-910124|http://digital.lib.uiowa.edu/cdm/ref/collection/duffy/id/256,,,,,,,,,,,,,,,,,,,,,,,,,,,,,,,,,,,,,,,,,,,,,,,,"<a href=""http://digital.lib.uiowa.edu/cdm/ref/collection/duffy/id/256"" target=""_blank"">View this item in its source respository</a>",,,,,,,,,,,,,,,,,,,,,,,,,,,,,http://www.iowaheritage.org/files/original/eea4d5796eaf49ed6e696cce89382008.jpg,"Remote Item","Editorial Cartoons of Brian Duffy",1,0
14719,http://www.iowaheritage.org/items/show/14719,"Lawler, IA. BN Xing MILW","Railroad stations|Burlington Northern Railroad Company|United States -- Iowa -- Wapello County -- Ottumwa|1990-2000|Chicago, Rock Island & Pacific Rail Road Co.","Shed near intersection of tracks. ""MILW Road. Lawler, IA. (Ottumwa, IA) BN xing.  [L]ooks N.  N.V.I. Ron Sims photo, 2717 Cornell, D.M. IA 50313""--Photograph verso.","Sims, Ronald D.",,"The University of Iowa Libraries Special Collections: http://www.lib.uiowa.edu/spec-coll/",1990-01-19|2006-04-25,,"Educational use only, no other permissions given. U.S. and international copyright laws may protect this digital image. Commercial use or distribution of the image is not permitted without prior permission of the copyright holder. For information see:  http://www.lib.uiowa.edu/spec-coll/help/copyright.html","John P. Vander Maas Railroadiana|John P. Vander Maas Railroadiana Collection|MSC0468|http://lib.uiowa.edu/collguides/?MSC0468|Vol. 47, Depots by county",8|12,,"Still image|Photographs|jpeg",47lawler01.jpg|169946290|https://digital.lib.uiowa.edu/,,,,,,,,,,,,,,,,,,,,,,,,,,,,,,,,,,,,,,,,,,,,,,,,"<a href=""https://digital.lib.uiowa.edu/"" target=""_blank"">View this item in its source respository</a>",,,,,,,,,,,,,,,,,,,,,,,,,,,,,http://www.iowaheritage.org/files/original/19041a60c6985a1d44e23a0b15ad7d7c.jpg,"Remote Item","John P. Vander Maas Railroadiana",1,0
14379,http://www.iowaheritage.org/items/show/14379,"Le Claire, IA. DRINW","Railroad stations|Davenport, Rock Island & North Western Railway Company|United States -- Iowa -- Scott County -- Le Claire|1990-2000|Buildings","Single story wooden depot and shed. ""R.I and N.W. [Lo]oks SE. Ron Sims photo, 2717 Cornell, IA 50313""--Photograph verso.","Sims, Ronald D.",,"The University of Iowa Libraries Special Collections: http://www.lib.uiowa.edu/spec-coll/",1990-08-06|2006-03-27,,"Educational use only, no other permissions given. U.S. and international copyright laws may protect this digital image. Commercial use or distribution of the image is not permitted without prior permission of the copyright holder. For information see:  http://www.lib.uiowa.edu/spec-coll/help/copyright.html","John P. Vander Maas Railroadiana|John P. Vander Maas Railroadiana Collection|MSC0468|http://lib.uiowa.edu/collguides/?MSC0468|Vol. 46, Depots by county",8|12,,"Still image|Photographs|jpeg",46leclaire02.jpg|169946290|https://digital.lib.uiowa.edu/,,,,,,,,,,,,,,,,,,,,,,,,,,,,,,,,,,,,,,,,,,,,,,,,"<a href=""https://digital.lib.uiowa.edu/"" target=""_blank"">View this item in its source respository</a>",,,,,,,,,,,,,,,,,,,,,,,,,,,,,http://www.iowaheritage.org/files/original/760b75d9c02e27c095c18a464007ad8d.jpg,"Remote Item","John P. Vander Maas Railroadiana",1,0
64475,http://www.iowaheritage.org/items/show/64475,Leapfrog,"Candidates|Dole, Robert J., 1923-|United States|Men|1990-2000|Republican Party|Political parties|Politicians|Politics|Campaigning|Campaigns|Conservatism|Gramm, Phil|Politicians|Leap frog","Ah'm more conservative; Dole; Gramm; I'm more conservative","Duffy, Brian, 1955-",,"University of Iowa. Libraries. Special Collections Dept.",1995-04-18|2011-04,,"Educational use only, no other permissions given. Copyright to this digital object is owned by The Des Moines Register; it may not be downloaded, reproduced, or distributed without written permission. For more information, contact the Special Collections Department.","Editorial Cartoons of Brian Duffy; Des Moines Register Cartoonists|Papers of Brian Duffy|Des Moines Register",,English,"Still image|Editorial cartoons",MSC916|duffy-950418|http://digital.lib.uiowa.edu/cdm/ref/collection/duffy/id/313,,,,,,,,,,,,,,,,,,,,,,,,,,,,,,,,,,,,,,,,,,,,,,,,"<a href=""http://digital.lib.uiowa.edu/cdm/ref/collection/duffy/id/313"" target=""_blank"">View this item in its source respository</a>",,,,,,,,,,,,,,,,,,,,,,,,,,,,,http://www.iowaheritage.org/files/original/da9164c65035f2d68d5db5d06d0a470a.jpg,"Remote Item","Editorial Cartoons of Brian Duffy",1,0
13782,http://www.iowaheritage.org/items/show/13782,"Letts, Iowa. SOO","Railroad stations|Soo Line Railroad Company|United States -- Iowa -- Louisa County -- Letts|1990-2000","Sign next to tracks. ""Looks E. Ron Sims photo, 2717 Cornell, D.M. IA 50313""--Photograph verso.","Sims, Ronald D.",,"The University of Iowa Libraries Special Collections: http://www.lib.uiowa.edu/spec-coll/",1993-04-02|2005-12-23,,"Educational use only, no other permissions given. U.S. and international copyright laws may protect this digital image. Commercial use or distribution of the image is not permitted without prior permission of the copyright holder. For information see:  http://www.lib.uiowa.edu/spec-coll/help/copyright.html","John P. Vander Maas Railroadiana|John P. Vander Maas Railroadiana Collection|MSC0468|http://lib.uiowa.edu/collguides/?MSC0468|Vol. 44, Depots by county",13|9,,"Still image|Photographs|jpeg",44letts02.jpg|169946290|https://digital.lib.uiowa.edu/,,,,,,,,,,,,,,,,,,,,,,,,,,,,,,,,,,,,,,,,,,,,,,,,"<a href=""https://digital.lib.uiowa.edu/"" target=""_blank"">View this item in its source respository</a>",,,,,,,,,,,,,,,,,,,,,,,,,,,,,http://www.iowaheritage.org/files/original/e6fc9be77bddf111e31522b9d5978832.jpg,"Remote Item","John P. Vander Maas Railroadiana",1,0
14742,http://www.iowaheritage.org/items/show/14742,"Lida, Iowa. CGW","Railroad stations|Chicago Great Western Railroad Company|United States -- Iowa -- Warren County -- Lida|1990-2000","Right of way. ""Looks N.  R.O.W. now ""Great Western"" trail.  Note ties for siding still in place.  Ron Sims photo, 2717 Cornell, D.M. IA 50313""--Photograph verso.","Sims, Ronald D.",,"The University of Iowa Libraries Special Collections: http://www.lib.uiowa.edu/spec-coll/",1992-05-28|2006-05-10,,"Educational use only, no other permissions given. U.S. and international copyright laws may protect this digital image. Commercial use or distribution of the image is not permitted without prior permission of the copyright holder. For information see:  http://www.lib.uiowa.edu/spec-coll/help/copyright.html","John P. Vander Maas Railroadiana|John P. Vander Maas Railroadiana Collection|MSC0468|http://lib.uiowa.edu/collguides/?MSC0468|Vol. 47, Depots by county",9|13,,"Still image|Photographs|jpeg",47lida01.jpg|169946290|https://digital.lib.uiowa.edu/,,,,,,,,,,,,,,,,,,,,,,,,,,,,,,,,,,,,,,,,,,,,,,,,"<a href=""https://digital.lib.uiowa.edu/"" target=""_blank"">View this item in its source respository</a>",,,,,,,,,,,,,,,,,,,,,,,,,,,,,http://www.iowaheritage.org/files/original/2db6e1de24a29a2dd7295ded8c1c60c1.jpg,"Remote Item","John P. Vander Maas Railroadiana",1,0
13738,http://www.iowaheritage.org/items/show/13738,"Lisbon, Iowa. CNW","Railroad stations|Chicago and North Western Railway Company|United States -- Iowa -- Linn County -- Lisbon|1990-2000|Buildings|Automobiles|Water towers|Grain elevators","Single story wooden depot with sign for Lisbon.  Truck next to depot.  Water tower and grain elevators behind depot. ""Looks W.  Ron Sims photo, 2717 Cornell, D.M. IA 50313""--Photograph verso.","Sims, Ronald D.",,"The University of Iowa Libraries Special Collections: http://www.lib.uiowa.edu/spec-coll/",1990-08-05|2005-12-23,,"Educational use only, no other permissions given. U.S. and international copyright laws may protect this digital image. Commercial use or distribution of the image is not permitted without prior permission of the copyright holder. For information see:  http://www.lib.uiowa.edu/spec-coll/help/copyright.html","John P. Vander Maas Railroadiana|John P. Vander Maas Railroadiana Collection|MSC0468|http://lib.uiowa.edu/collguides/?MSC0468|Vol. 44, Depots by county",9|13,,"Still image|Photographs|jpeg",44lisbon03.jpg|169946290|https://digital.lib.uiowa.edu/,,,,,,,,,,,,,,,,,,,,,,,,,,,,,,,,,,,,,,,,,,,,,,,,"<a href=""https://digital.lib.uiowa.edu/"" target=""_blank"">View this item in its source respository</a>",,,,,,,,,,,,,,,,,,,,,,,,,,,,,http://www.iowaheritage.org/files/original/edb4314c32f9885fd50df40a12ab3778.jpg,"Remote Item","John P. Vander Maas Railroadiana",1,0
13378,http://www.iowaheritage.org/items/show/13378,"Lockridge, Iowa. BN","Railroad stations|Burlington Northern Railroad Company|United States -- Iowa -- Jefferson County -- Lockridge|1990-2000","Sign for Lockridge on two poles next to tracks. ""Looks E. Ron Sims photo, 2717 Cornell, D.M. IA 50313""--Photograph verso.","Sims, Ronald D.",,"The University of Iowa Libraries Special Collections: http://www.lib.uiowa.edu/spec-coll/",1991-04-24|2005-11-18,,"Educational use only, no other permissions given. U.S. and international copyright laws may protect this digital image. Commercial use or distribution of the image is not permitted without prior permission of the copyright holder. For information see:  http://www.lib.uiowa.edu/spec-coll/help/copyright.html","John P. Vander Maas Railroadiana|John P. Vander Maas Railroadiana Collection|MSC0468|http://lib.uiowa.edu/collguides/?MSC0468|Vol. 43, Depots by county",9|13,,"Still image|Photographs|jpeg",43lockridge02.jpg|169946290|https://digital.lib.uiowa.edu/,,,,,,,,,,,,,,,,,,,,,,,,,,,,,,,,,,,,,,,,,,,,,,,,"<a href=""https://digital.lib.uiowa.edu/"" target=""_blank"">View this item in its source respository</a>",,,,,,,,,,,,,,,,,,,,,,,,,,,,,http://www.iowaheritage.org/files/original/264f01e6434b45a623ba1ba862590ef3.jpg,"Remote Item","John P. Vander Maas Railroadiana",1,0
64501,http://www.iowaheritage.org/items/show/64501,"Looks like another big storm coming","Farmers|United States|Lightning|1990-2000|Farms|Farming|Economic cycles|Economic conditions|Agriculture|Agriculture -- Economic aspects|Clouds|Storms|Men|Farmers|Farmland|Farms|Trucks|Barns","Farm crisis","Duffy, Brian, 1955-",,"University of Iowa. Libraries. Special Collections Dept.",1998-12-15|2011-04,,"Educational use only, no other permissions given. Copyright to this digital object is owned by The Des Moines Register; it may not be downloaded, reproduced, or distributed without written permission. For more information, contact the Special Collections Department.","Editorial Cartoons of Brian Duffy; Des Moines Register Cartoonists|Papers of Brian Duffy|Des Moines Register",,English,"Still image|Editorial cartoons",MSC916|duffy-981215|http://digital.lib.uiowa.edu/cdm/ref/collection/duffy/id/339,,,,,,,,,,,,,,,,,,,,,,,,,,,,,,,,,,,,,,,,,,,,,,,,"<a href=""http://digital.lib.uiowa.edu/cdm/ref/collection/duffy/id/339"" target=""_blank"">View this item in its source respository</a>",,,,,,,,,,,,,,,,,,,,,,,,,,,,,http://www.iowaheritage.org/files/original/c26fd2f3855808e87a7a59d89f5ed708.jpg,"Remote Item","Editorial Cartoons of Brian Duffy",1,0
