 




﻿"Item Id","Item URI","Dublin Core:Title","Dublin Core:Subject","Dublin Core:Description","Dublin Core:Creator","Dublin Core:Source","Dublin Core:Publisher","Dublin Core:Date","Dublin Core:Contributor","Dublin Core:Rights","Dublin Core:Relation","Dublin Core:Format","Dublin Core:Language","Dublin Core:Type","Dublin Core:Identifier","Dublin Core:Coverage","Item Type Metadata:Text","Item Type Metadata:Interviewer","Item Type Metadata:Interviewee","Item Type Metadata:Location","Item Type Metadata:Transcription","Item Type Metadata:Local URL","Item Type Metadata:Original Format","Item Type Metadata:Physical Dimensions","Item Type Metadata:Duration","Item Type Metadata:Compression","Item Type Metadata:Producer","Item Type Metadata:Director","Item Type Metadata:Bit Rate/Frequency","Item Type Metadata:Time Summary","Item Type Metadata:Email Body","Item Type Metadata:Subject Line","Item Type Metadata:From","Item Type Metadata:To","Item Type Metadata:CC","Item Type Metadata:BCC","Item Type Metadata:Number of Attachments","Item Type Metadata:Standards","Item Type Metadata:Objectives","Item Type Metadata:Materials","Item Type Metadata:Lesson Plan Text","Item Type Metadata:URL","Item Type Metadata:Event Type","Item Type Metadata:Participants","Item Type Metadata:Birth Date","Item Type Metadata:Birthplace","Item Type Metadata:Death Date","Item Type Metadata:Occupation","Item Type Metadata:Biographical Text","Item Type Metadata:Bibliography","Item Type Metadata:Digital Reproduction Information","Item Type Metadata:Repository","Item Type Metadata:Repository Collection","Item Type Metadata:Contact information.","Item Type Metadata:File Name","Item Type Metadata:Notes","Item Type Metadata:Digital item created","Item Type Metadata:Digital item modified","Item Type Metadata:Executive Orders","Item Type Metadata:Record Created","Item Type Metadata:Record Modified","Item Type Metadata:Transcription2","Item Type Metadata:Source URL","Omeka Legacy File:Additional Creator","Omeka Legacy File:Transcriber","Omeka Legacy File:Producer","Omeka Legacy File:Render Device","Omeka Legacy File:Render Details","Omeka Legacy File:Capture Date","Omeka Legacy File:Capture Device","Omeka Legacy File:Capture Details","Omeka Legacy File:Change History","Omeka Legacy File:Watermark","Omeka Legacy File:Encryption","Omeka Legacy File:Compression","Omeka Legacy File:Post Processing","Omeka Image File:Width","Omeka Image File:Height","Omeka Image File:Bit Depth","Omeka Image File:Channels","Omeka Image File:Exif String","Omeka Image File:Exif Array","Omeka Image File:IPTC String","Omeka Image File:IPTC Array","Omeka Video File:Bitrate","Omeka Video File:Duration","Omeka Video File:Sample Rate","Omeka Video File:Codec","Omeka Video File:Width","Omeka Video File:Height",tags,file,itemType,collection,public,featured
17142,http://www.iowaheritage.org/items/show/17142,"Henry Wallace with air aces, Siberia, 1944","Vice presidents|Americans|Wallace, Henry A. (Henry Agard), 1888-1965|Russia -- Siberia|1940-1950|Air pilots|Russians|Kight, Richard T.|Mazuruk, Ilya P.",,unidentified,,"University of Iowa. Libraries. Special Collections Dept.",1944,,"Educational use only, no other permissions given. U.S. and international copyright laws may protect this item. Commercial use or distribution of this digital object is not permitted without written permission of the University of Iowa Special Collections Dept.","Henry A. Wallace Collection|Henry Agard Wallace papers|http://lib.uiowa.edu/collguides/?MSC0177|Photographs & images|China-Siberia Trip, 1944|Scanned with Ricoh 3228C scanner at 600 ppi. Archival tiff available.",jpeg,,"Still image; Text|Photographs",MSC0177|7|wal73sa-001.jpg|https://digital.lib.uiowa.edu/,,,,,,,,,,,,,,,,,,,,,,,,,,,,,,,,,,,,,,,,,,,,,,,,"<a href=""https://digital.lib.uiowa.edu/"" target=""_blank"">View this item in its source respository</a>",,,,,,,,,,,,,,,,,,,,,,,,,,,,,http://www.iowaheritage.org/files/original/1b16134f62782407fdd05214c92c4c90.jpg,"Remote Item","Henry A. Wallace Collection",1,0
17140,http://www.iowaheritage.org/items/show/17140,"Photostat copy of Buryat language newspaper, Siberia, 1944","Newspapers|Wallace, Henry A. (Henry Agard), 1888-1965|Russia -- Siberia|1940-1950","Buryat-Mongol UNEN, June 4, 1944. Vice President Wallace speech on front page.",unidentified,,"University of Iowa. Libraries. Special Collections Dept.",1944|2009-02-20,,"Educational use only, no other permissions given. U.S. and international copyright laws may protect this item. Commercial use or distribution of this digital object is not permitted without written permission of the University of Iowa Special Collections Dept.","Henry A. Wallace Collection|Henry Agard Wallace papers|http://lib.uiowa.edu/collguides/?MSC0177|Photographs & images|China-Siberia Trip, 1944|Scanned with Ricoh 3228C scanner at 600 ppi. Archival tiff available.",jpeg,,"Text|Clippings (Information artifacts); Stats (copies)",MSC0177|7|wal73sa-doc_c.jpg|https://digital.lib.uiowa.edu/,,,,,,,,,,,,,,,,,,,,,,,,,,,,,,,,,,,,,,,,,,,,,,,,"<a href=""https://digital.lib.uiowa.edu/"" target=""_blank"">View this item in its source respository</a>",,,,,,,,,,,,,,,,,,,,,,,,,,,,,http://www.iowaheritage.org/files/original/143736213227a3cb82aeb9a891f5d7b6.jpg,"Remote Item","Henry A. Wallace Collection",1,0
17117,http://www.iowaheritage.org/items/show/17117,"Desert kitchen and camp wife, Siberia, 1944","Prairies|Kazakhs|Russia -- Siberia|1940-1950|Cooking utensils|Pots & pans|Camping|Women",,unidentified,,"University of Iowa. Libraries. Special Collections Dept.",1944|2009-02-20,,"Educational use only, no other permissions given. U.S. and international copyright laws may protect this item. Commercial use or distribution of this digital object is not permitted without written permission of the University of Iowa Special Collections Dept.","Henry A. Wallace Collection|Henry Agard Wallace papers|http://lib.uiowa.edu/collguides/?MSC0177|Photographs & images|China-Siberia Trip, 1944|Scanned with Ricoh 3228C scanner at 600 ppi. Archival tiff available.",jpeg,,"Still image; Text|Photographs",MSC0177|7|wal73sa-054.jpg|https://digital.lib.uiowa.edu/,,,,,,,,,,,,,,,,,,,,,,,,,,,,,,,,,,,,,,,,,,,,,,,,"<a href=""https://digital.lib.uiowa.edu/"" target=""_blank"">View this item in its source respository</a>",,,,,,,,,,,,,,,,,,,,,,,,,,,,,http://www.iowaheritage.org/files/original/5135b9b2533873f683297eb11cdbed3a.jpg,"Remote Item","Henry A. Wallace Collection",1,0
17115,http://www.iowaheritage.org/items/show/17115,"Kazakh mare and yurt, Siberia, 1944","Horses|Kazakhs|Russia -- Siberia|1940-1950|Milking|Yurts|Steppes",,unidentified,,"University of Iowa. Libraries. Special Collections Dept.",1944|2009-02-20,,"Educational use only, no other permissions given. U.S. and international copyright laws may protect this item. Commercial use or distribution of this digital object is not permitted without written permission of the University of Iowa Special Collections Dept.","Henry A. Wallace Collection|Henry Agard Wallace papers|http://lib.uiowa.edu/collguides/?MSC0177|Photographs & images|China-Siberia Trip, 1944|Scanned with Ricoh 3228C scanner at 600 ppi. Archival tiff available.",jpeg,,"Still image; Text|Photographs",MSC0177|7|wal73sa-053.jpg|https://digital.lib.uiowa.edu/,,,,,,,,,,,,,,,,,,,,,,,,,,,,,,,,,,,,,,,,,,,,,,,,"<a href=""https://digital.lib.uiowa.edu/"" target=""_blank"">View this item in its source respository</a>",,,,,,,,,,,,,,,,,,,,,,,,,,,,,http://www.iowaheritage.org/files/original/0bc410e9c8aafc85c032ff79305b2ede.jpg,"Remote Item","Henry A. Wallace Collection",1,0
17113,http://www.iowaheritage.org/items/show/17113,"Camel of the Kazakh steppe country, Siberia, 1944","Camels|Kazakhs|Russia -- Siberia|1940-1950|Steppes",,unidentified,,"University of Iowa. Libraries. Special Collections Dept.",1944|2009-02-20,,"Educational use only, no other permissions given. U.S. and international copyright laws may protect this item. Commercial use or distribution of this digital object is not permitted without written permission of the University of Iowa Special Collections Dept.","Henry A. Wallace Collection|Henry Agard Wallace papers|http://lib.uiowa.edu/collguides/?MSC0177|Photographs & images|China-Siberia Trip, 1944|Scanned with Ricoh 3228C scanner at 600 ppi. Archival tiff available.",jpeg,,"Still image; Text|Photographs",MSC0177|7|wal73sa-052.jpg|https://digital.lib.uiowa.edu/,,,,,,,,,,,,,,,,,,,,,,,,,,,,,,,,,,,,,,,,,,,,,,,,"<a href=""https://digital.lib.uiowa.edu/"" target=""_blank"">View this item in its source respository</a>",,,,,,,,,,,,,,,,,,,,,,,,,,,,,http://www.iowaheritage.org/files/original/ebeadc90db2728110aaae6a63d1ab272.jpg,"Remote Item","Henry A. Wallace Collection",1,0
17111,http://www.iowaheritage.org/items/show/17111,"Henry Wallace and Kazakhs drinking bowls of kumis, Siberia, 1944","Vice presidents|Americans|Wallace, Henry A. (Henry Agard), 1888-1965|Russia -- Siberia|1940-1950|Eating & drinking|Sheep ranches|Kazakhs",,unidentified,,"University of Iowa. Libraries. Special Collections Dept.",1944|2009-02-20,,"Educational use only, no other permissions given. U.S. and international copyright laws may protect this item. Commercial use or distribution of this digital object is not permitted without written permission of the University of Iowa Special Collections Dept.","Henry A. Wallace Collection|Henry Agard Wallace papers|http://lib.uiowa.edu/collguides/?MSC0177|Photographs & images|China-Siberia Trip, 1944|Scanned with Ricoh 3228C scanner at 600 ppi. Archival tiff available.",jpeg,,"Still image; Text|Photographs",MSC0177|7|wal73sa-050.jpg|https://digital.lib.uiowa.edu/,,,,,,,,,,,,,,,,,,,,,,,,,,,,,,,,,,,,,,,,,,,,,,,,"<a href=""https://digital.lib.uiowa.edu/"" target=""_blank"">View this item in its source respository</a>",,,,,,,,,,,,,,,,,,,,,,,,,,,,,http://www.iowaheritage.org/files/original/32898ff3f0452bb31d01f965998d47a5.jpg,"Remote Item","Henry A. Wallace Collection",1,0
17109,http://www.iowaheritage.org/items/show/17109,"Buryat women, Siberia, 1944","Women|Buriats|Russia -- Siberia|1940-1950|Ethnic costume",,unidentified,,"University of Iowa. Libraries. Special Collections Dept.",1944|2009-02-20,,"Educational use only, no other permissions given. U.S. and international copyright laws may protect this item. Commercial use or distribution of this digital object is not permitted without written permission of the University of Iowa Special Collections Dept.","Henry A. Wallace Collection|Henry Agard Wallace papers|http://lib.uiowa.edu/collguides/?MSC0177|Photographs & images|China-Siberia Trip, 1944|Scanned with Ricoh 3228C scanner at 600 ppi. Archival tiff available.",jpeg,,"Still image; Text|Photographs",MSC0177|7|wal73sa-048.jpg|https://digital.lib.uiowa.edu/,,,,,,,,,,,,,,,,,,,,,,,,,,,,,,,,,,,,,,,,,,,,,,,,"<a href=""https://digital.lib.uiowa.edu/"" target=""_blank"">View this item in its source respository</a>",,,,,,,,,,,,,,,,,,,,,,,,,,,,,http://www.iowaheritage.org/files/original/869cab8362fd5ca0db25161ee7a5d913.jpg,"Remote Item","Henry A. Wallace Collection",1,0
17103,http://www.iowaheritage.org/items/show/17103,"Buryat collective farm, Siberia, 1944","Collective farms|Buriats|Russia -- Siberia|1940-1950|Musical instruments|Silos|Rural women|Americans",,unidentified,,"University of Iowa. Libraries. Special Collections Dept.",1944|2009-02-20,,"Educational use only, no other permissions given. U.S. and international copyright laws may protect this item. Commercial use or distribution of this digital object is not permitted without written permission of the University of Iowa Special Collections Dept.","Henry A. Wallace Collection|Henry Agard Wallace papers|http://lib.uiowa.edu/collguides/?MSC0177|Photographs & images|China-Siberia Trip, 1944|Scanned with Ricoh 3228C scanner at 600 ppi. Archival tiff available.",jpeg,,"Still image; Text|Photographs",MSC0177|7|wal73sa-045.jpg|https://digital.lib.uiowa.edu/,,,,,,,,,,,,,,,,,,,,,,,,,,,,,,,,,,,,,,,,,,,,,,,,"<a href=""https://digital.lib.uiowa.edu/"" target=""_blank"">View this item in its source respository</a>",,,,,,,,,,,,,,,,,,,,,,,,,,,,,http://www.iowaheritage.org/files/original/2a41ac792ae6cc07974636bd2f2dc519.jpg,"Remote Item","Henry A. Wallace Collection",1,0
17099,http://www.iowaheritage.org/items/show/17099,"Men and cattle, Siberia, 1944","Cattle|Americans|Wallace, Henry A. (Henry Agard), 1888-1965|Russia -- Siberia|1940-1950|Vice presidents|Men|Russians|Simmental cattle","In bottom picture, Henry Wallace inspects cow.",unidentified,,"University of Iowa. Libraries. Special Collections Dept.",1944|2009-02-20,,"Educational use only, no other permissions given. U.S. and international copyright laws may protect this item. Commercial use or distribution of this digital object is not permitted without written permission of the University of Iowa Special Collections Dept.","Henry A. Wallace Collection|Henry Agard Wallace papers|http://lib.uiowa.edu/collguides/?MSC0177|Photographs & images|China-Siberia Trip, 1944|Scanned with Ricoh 3228C scanner at 600 ppi. Archival tiff available.",jpeg,,"Still image; Text|Photographs",MSC0177|7|wal73sa-041.jpg|https://digital.lib.uiowa.edu/,,,,,,,,,,,,,,,,,,,,,,,,,,,,,,,,,,,,,,,,,,,,,,,,"<a href=""https://digital.lib.uiowa.edu/"" target=""_blank"">View this item in its source respository</a>",,,,,,,,,,,,,,,,,,,,,,,,,,,,,http://www.iowaheritage.org/files/original/e1106f2836efd34b89aec58d500926b8.jpg,"Remote Item","Henry A. Wallace Collection",1,0
17097,http://www.iowaheritage.org/items/show/17097,"Woman looking out second story window, Siberia, 1944","Women|Russians|Russia -- Siberia|1940-1950|Buildings",,unidentified,,"University of Iowa. Libraries. Special Collections Dept.",1944|2009-02-20,,"Educational use only, no other permissions given. U.S. and international copyright laws may protect this item. Commercial use or distribution of this digital object is not permitted without written permission of the University of Iowa Special Collections Dept.","Henry A. Wallace Collection|Henry Agard Wallace papers|http://lib.uiowa.edu/collguides/?MSC0177|Photographs & images|China-Siberia Trip, 1944|Scanned with Ricoh 3228C scanner at 600 ppi. Archival tiff available.",jpeg,,"Still image|Photographs",MSC0177|7|wal73sa-039.jpg|https://digital.lib.uiowa.edu/,,,,,,,,,,,,,,,,,,,,,,,,,,,,,,,,,,,,,,,,,,,,,,,,"<a href=""https://digital.lib.uiowa.edu/"" target=""_blank"">View this item in its source respository</a>",,,,,,,,,,,,,,,,,,,,,,,,,,,,,http://www.iowaheritage.org/files/original/349686ef07493cf6180a6aa3656eb6ed.jpg,"Remote Item","Henry A. Wallace Collection",1,0
