 




﻿"Item Id","Item URI","Dublin Core:Title","Dublin Core:Subject","Dublin Core:Description","Dublin Core:Creator","Dublin Core:Source","Dublin Core:Publisher","Dublin Core:Date","Dublin Core:Contributor","Dublin Core:Rights","Dublin Core:Relation","Dublin Core:Format","Dublin Core:Language","Dublin Core:Type","Dublin Core:Identifier","Dublin Core:Coverage","Item Type Metadata:Text","Item Type Metadata:Interviewer","Item Type Metadata:Interviewee","Item Type Metadata:Location","Item Type Metadata:Transcription","Item Type Metadata:Local URL","Item Type Metadata:Original Format","Item Type Metadata:Physical Dimensions","Item Type Metadata:Duration","Item Type Metadata:Compression","Item Type Metadata:Producer","Item Type Metadata:Director","Item Type Metadata:Bit Rate/Frequency","Item Type Metadata:Time Summary","Item Type Metadata:Email Body","Item Type Metadata:Subject Line","Item Type Metadata:From","Item Type Metadata:To","Item Type Metadata:CC","Item Type Metadata:BCC","Item Type Metadata:Number of Attachments","Item Type Metadata:Standards","Item Type Metadata:Objectives","Item Type Metadata:Materials","Item Type Metadata:Lesson Plan Text","Item Type Metadata:URL","Item Type Metadata:Event Type","Item Type Metadata:Participants","Item Type Metadata:Birth Date","Item Type Metadata:Birthplace","Item Type Metadata:Death Date","Item Type Metadata:Occupation","Item Type Metadata:Biographical Text","Item Type Metadata:Bibliography","Item Type Metadata:Digital Reproduction Information","Item Type Metadata:Repository","Item Type Metadata:Repository Collection","Item Type Metadata:Contact information.","Item Type Metadata:File Name","Item Type Metadata:Notes","Item Type Metadata:Digital item created","Item Type Metadata:Digital item modified","Item Type Metadata:Executive Orders","Item Type Metadata:Record Created","Item Type Metadata:Record Modified","Item Type Metadata:Transcription2","Item Type Metadata:Source URL","Omeka Legacy File:Additional Creator","Omeka Legacy File:Transcriber","Omeka Legacy File:Producer","Omeka Legacy File:Render Device","Omeka Legacy File:Render Details","Omeka Legacy File:Capture Date","Omeka Legacy File:Capture Device","Omeka Legacy File:Capture Details","Omeka Legacy File:Change History","Omeka Legacy File:Watermark","Omeka Legacy File:Encryption","Omeka Legacy File:Compression","Omeka Legacy File:Post Processing","Omeka Image File:Width","Omeka Image File:Height","Omeka Image File:Bit Depth","Omeka Image File:Channels","Omeka Image File:Exif String","Omeka Image File:Exif Array","Omeka Image File:IPTC String","Omeka Image File:IPTC Array","Omeka Video File:Bitrate","Omeka Video File:Duration","Omeka Video File:Sample Rate","Omeka Video File:Codec","Omeka Video File:Width","Omeka Video File:Height",tags,file,itemType,collection,public,featured
64393,http://www.iowaheritage.org/items/show/64393,"George Bush as a withered, heat-exhausted sunflower","Presidency|Bush, George, 1924-|United States|Sun|1980-1990|Presidents -- United States|Presidents|Public opinion|Politicians|Politics|Sunflowers|Presidents|Heat|Droughts",,"Duffy, Brian, 1955-",,"University of Iowa. Libraries. Special Collections Dept.",1988-05|2011-04,,"Educational use only, no other permissions given. Copyright to this digital object is owned by The Des Moines Register; it may not be downloaded, reproduced, or distributed without written permission. For more information, contact the Special Collections Department.","Editorial Cartoons of Brian Duffy; Des Moines Register Cartoonists|Papers of Brian Duffy|Des Moines Register",,English,"Still image|Editorial cartoons","MSC916|duffy-8805xx-undated 5|http://digital.lib.uiowa.edu/cdm/ref/collection/duffy/id/231",,,,,,,,,,,,,,,,,,,,,,,,,,,,,,,,,,,,,,,,,,,,,,,,"<a href=""http://digital.lib.uiowa.edu/cdm/ref/collection/duffy/id/231"" target=""_blank"">View this item in its source respository</a>",,,,,,,,,,,,,,,,,,,,,,,,,,,,,http://www.iowaheritage.org/files/original/884e762dfbb7ac6072343e769f339991.jpg,"Remote Item","Editorial Cartoons of Brian Duffy",1,0
64398,http://www.iowaheritage.org/items/show/64398,"Now I know how the San Francisco Giants must have felt","Presidents|Bush, George, 1924-|Washington (D.C.)|Presidents|1980-1990|Presidents -- United States|Elections|Elections -- United States|Political parties|Democrats|Republicans|Flags|Desks|Offices|Telephones|Papers|Newspapers|Newspaper headlines|Windows","News; Democrats sweep elections N.V., New Jersey, Virginia; Wait; In","Duffy, Brian, 1955-",,"University of Iowa. Libraries. Special Collections Dept.",1989-11-09|2011-04,,"Educational use only, no other permissions given. Copyright to this digital object is owned by The Des Moines Register; it may not be downloaded, reproduced, or distributed without written permission. For more information, contact the Special Collections Department.","Editorial Cartoons of Brian Duffy; Des Moines Register Cartoonists|Papers of Brian Duffy|Des Moines Register",,English,"Still image|Editorial cartoons",MSC916|duffy-891109|http://digital.lib.uiowa.edu/cdm/ref/collection/duffy/id/236,,,,,,,,,,,,,,,,,,,,,,,,,,,,,,,,,,,,,,,,,,,,,,,,"<a href=""http://digital.lib.uiowa.edu/cdm/ref/collection/duffy/id/236"" target=""_blank"">View this item in its source respository</a>",,,,,,,,,,,,,,,,,,,,,,,,,,,,,http://www.iowaheritage.org/files/original/a5b24e4e5fe8e3975a6ce27f6e4e4b4a.jpg,"Remote Item","Editorial Cartoons of Brian Duffy",1,0
64411,http://www.iowaheritage.org/items/show/64411,"War powers","Presidents|Bush, George, 1924-|United States|Presidents|1990-2000|Presidents -- United States|War|Wars|Aggression|Aggression (International law)|Congress|Power|Politicians|Politics|Men|Arrows|Eagles|Ruts",Congress,"Duffy, Brian, 1955-",,"University of Iowa. Libraries. Special Collections Dept.",1991-01-08|2011-04,,"Educational use only, no other permissions given. Copyright to this digital object is owned by The Des Moines Register; it may not be downloaded, reproduced, or distributed without written permission. For more information, contact the Special Collections Department.","Editorial Cartoons of Brian Duffy; Des Moines Register Cartoonists|Papers of Brian Duffy|Des Moines Register",,English,"Still image|Editorial cartoons",MSC916|duffy-910108|http://digital.lib.uiowa.edu/cdm/ref/collection/duffy/id/249,,,,,,,,,,,,,,,,,,,,,,,,,,,,,,,,,,,,,,,,,,,,,,,,"<a href=""http://digital.lib.uiowa.edu/cdm/ref/collection/duffy/id/249"" target=""_blank"">View this item in its source respository</a>",,,,,,,,,,,,,,,,,,,,,,,,,,,,,http://www.iowaheritage.org/files/original/672b201b00b6814fcf9d806cc4860ca3.jpg,"Remote Item","Editorial Cartoons of Brian Duffy",1,0
64479,http://www.iowaheritage.org/items/show/64479,"Have you noticed that it's windier than usual this year?","Campaigns|United States|Men|1990-2000|Campaigning|Presidents -- United States|Presidency|Candidates|Speeches|Influence|Elections|Elections -- United States|Women|Wind|Hats|Signs|Politicians|Candidates","Elect me; For President","Duffy, Brian, 1955-",,"University of Iowa. Libraries. Special Collections Dept.",1995-04-23|2011-04,,"Educational use only, no other permissions given. Copyright to this digital object is owned by The Des Moines Register; it may not be downloaded, reproduced, or distributed without written permission. For more information, contact the Special Collections Department.","Editorial Cartoons of Brian Duffy; Des Moines Register Cartoonists|Papers of Brian Duffy|Des Moines Register",,English,"Still image|Editorial cartoons",MSC916|duffy-950423|http://digital.lib.uiowa.edu/cdm/ref/collection/duffy/id/317,,,,,,,,,,,,,,,,,,,,,,,,,,,,,,,,,,,,,,,,,,,,,,,,"<a href=""http://digital.lib.uiowa.edu/cdm/ref/collection/duffy/id/317"" target=""_blank"">View this item in its source respository</a>",,,,,,,,,,,,,,,,,,,,,,,,,,,,,http://www.iowaheritage.org/files/original/282d0a3161ad86c7f7e10beb867eb696.jpg,"Remote Item","Editorial Cartoons of Brian Duffy",1,0
64499,http://www.iowaheritage.org/items/show/64499,"Congress maintenance dept.","Presidents|Johnson, Andrew, 1808-1875|United States|Men|1990-2000|Presidents -- United States|Congress|Impeachments|Nixon, Richard M. (Richard Milhous), 1913-1994|Clinton, Bill, 1946-|Washington (D.C.)|Presidents|Hammers|Ladders|Nails|Portraits|Signs","Andrew Johnson; Richard Nixon; Bill","Duffy, Brian, 1955-",,"University of Iowa. Libraries. Special Collections Dept.",1998-12-11|2011-04,,"Educational use only, no other permissions given. Copyright to this digital object is owned by The Des Moines Register; it may not be downloaded, reproduced, or distributed without written permission. For more information, contact the Special Collections Department.","Editorial Cartoons of Brian Duffy; Des Moines Register Cartoonists|Papers of Brian Duffy|Des Moines Register",,English,"Still image|Editorial cartoons",MSC916|duffy-981211|http://digital.lib.uiowa.edu/cdm/ref/collection/duffy/id/337,,,,,,,,,,,,,,,,,,,,,,,,,,,,,,,,,,,,,,,,,,,,,,,,"<a href=""http://digital.lib.uiowa.edu/cdm/ref/collection/duffy/id/337"" target=""_blank"">View this item in its source respository</a>",,,,,,,,,,,,,,,,,,,,,,,,,,,,,http://www.iowaheritage.org/files/original/6f98382d824d9e94e35160f62f8dc2d6.jpg,"Remote Item","Editorial Cartoons of Brian Duffy",1,0
64538,http://www.iowaheritage.org/items/show/64538,"The Larry Speakes Show","Presidency|Speakes, Larry|United States|Senators|1980-1990|Presidents -- United States|Presidents|Presidential power|Presidential appointees|Press|Senate|Campaigning|Campaigns|Republican Party|Political promises|Political parties|Political influence|Politics|Politicians|Washington (D.C.)|Senate|Press|Press conferences|Men|Podiums|Microphones|Ladders|Flags|Contracts|Pens|Signs|Stars","And you can forget about the president campaigning for you in '86!; Could I have that in writing?; Senate Republicans; We know who our friends are","Duffy, Brian, 1955-",,"University of Iowa. Libraries. Special Collections Dept.",1985-03-19|2011-04,,"Educational use only, no other permissions given. Copyright to this digital object is owned by The Des Moines Register; it may not be downloaded, reproduced, or distributed without written permission. For more information, contact the Special Collections Department.","Editorial Cartoons of Brian Duffy; Des Moines Register Cartoonists|Papers of Brian Duffy|Des Moines Register",,English,"Still image|Editorial cartoons",MSC916|duffy-850319|http://digital.lib.uiowa.edu/cdm/ref/collection/duffy/id/376,,,,,,,,,,,,,,,,,,,,,,,,,,,,,,,,,,,,,,,,,,,,,,,,"<a href=""http://digital.lib.uiowa.edu/cdm/ref/collection/duffy/id/376"" target=""_blank"">View this item in its source respository</a>",,,,,,,,,,,,,,,,,,,,,,,,,,,,,http://www.iowaheritage.org/files/original/9b0b2d87ecd91756108d848c20d8ef71.jpg,"Remote Item","Editorial Cartoons of Brian Duffy",1,0
64540,http://www.iowaheritage.org/items/show/64540,"Ventriloquist Ronald Reagan","Presidents|Reagan, Ronald|United States|Presidents|1980-1990|Presidents -- United States|Presidential power|Presidential appointees|Press|Men|Ventriloquism|Dummies|Comedians|Stools|Eggs|Eggshells|Chickens|Bottles|Eyeglasses|Puppets",,"Duffy, Brian, 1955-",,"University of Iowa. Libraries. Special Collections Dept.",1985-03-03|2011-04,,"Educational use only, no other permissions given. Copyright to this digital object is owned by The Des Moines Register; it may not be downloaded, reproduced, or distributed without written permission. For more information, contact the Special Collections Department.","Editorial Cartoons of Brian Duffy; Des Moines Register Cartoonists|Papers of Brian Duffy|Des Moines Register",,English,"Still image|Editorial cartoons",MSC916|duffy-850303|http://digital.lib.uiowa.edu/cdm/ref/collection/duffy/id/378,,,,,,,,,,,,,,,,,,,,,,,,,,,,,,,,,,,,,,,,,,,,,,,,"<a href=""http://digital.lib.uiowa.edu/cdm/ref/collection/duffy/id/378"" target=""_blank"">View this item in its source respository</a>",,,,,,,,,,,,,,,,,,,,,,,,,,,,,http://www.iowaheritage.org/files/original/4408a022dd840bb26167a6c538dd0cc2.jpg,"Remote Item","Editorial Cartoons of Brian Duffy",1,0
64543,http://www.iowaheritage.org/items/show/64543,"Dirty Ronnie","Vetoes|Reagan, Ronald|United States|Guns|1980-1990|Presidents|Presidential vetoes|Presidents -- United States|Congress|Taxes|Taxation|Presidents|Men|Bullet holes","Go ahead, punk, make my day!; Veto; Tax hike; Congress","Duffy, Brian, 1955-",,"University of Iowa. Libraries. Special Collections Dept.",1985-03-15|2011-04,,"Educational use only, no other permissions given. Copyright to this digital object is owned by The Des Moines Register; it may not be downloaded, reproduced, or distributed without written permission. For more information, contact the Special Collections Department.","Editorial Cartoons of Brian Duffy; Des Moines Register Cartoonists|Papers of Brian Duffy|Des Moines Register",,English,"Still image|Editorial cartoons",MSC916|duffy-850315|http://digital.lib.uiowa.edu/cdm/ref/collection/duffy/id/381,,,,,,,,,,,,,,,,,,,,,,,,,,,,,,,,,,,,,,,,,,,,,,,,"<a href=""http://digital.lib.uiowa.edu/cdm/ref/collection/duffy/id/381"" target=""_blank"">View this item in its source respository</a>",,,,,,,,,,,,,,,,,,,,,,,,,,,,,http://www.iowaheritage.org/files/original/75c1a45b290fc91f897cd76efea55b63.jpg,"Remote Item","Editorial Cartoons of Brian Duffy",1,0
64559,http://www.iowaheritage.org/items/show/64559,"President Donald Regan","Presidency|Regan, Donald T.|Washington (D.C.)|Offices|1980-1990|Presidents -- United States|Vice presidents|Congress|Power|Popularity|Reagan, Ronald|Bush, George, 1924-|Desks|Candy|Flags|Monuments|Windows|Signs|Men|Senators|Presidents",Bush,"Duffy, Brian, 1955-",,"University of Iowa. Libraries. Special Collections Dept.",1985-07-17|2011-04,,"Educational use only, no other permissions given. Copyright to this digital object is owned by The Des Moines Register; it may not be downloaded, reproduced, or distributed without written permission. For more information, contact the Special Collections Department.","Editorial Cartoons of Brian Duffy; Des Moines Register Cartoonists|Papers of Brian Duffy|Des Moines Register",,English,"Still image|Editorial cartoons",MSC916|duffy-850717|http://digital.lib.uiowa.edu/cdm/ref/collection/duffy/id/397,,,,,,,,,,,,,,,,,,,,,,,,,,,,,,,,,,,,,,,,,,,,,,,,"<a href=""http://digital.lib.uiowa.edu/cdm/ref/collection/duffy/id/397"" target=""_blank"">View this item in its source respository</a>",,,,,,,,,,,,,,,,,,,,,,,,,,,,,http://www.iowaheritage.org/files/original/7fad69ef5478dd7cb0af2f5a79923b5a.jpg,"Remote Item","Editorial Cartoons of Brian Duffy",1,0
64585,http://www.iowaheritage.org/items/show/64585,"Troop reduction plan","Presidents|Bush, George, 1924-|United States|Presidents|1980-1990|Presidents -- United States|Presidents -- Soviet Union|Military force|Military policy|Military|Promises|Pacts|United States -- Foreign relations -- Soviet Union|United States -- Foreign relations|Gorbachev, Mikhail Sergeevich, 1931-|Soviet Union|Dancing|Dancers|Hats|Staffs (Sticks)|Spotlights|Stages","Gorby; Bop!","Duffy, Brian, 1955-",,"University of Iowa. Libraries. Special Collections Dept.",1989-05-31|2011-04,,"Educational use only, no other permissions given. Copyright to this digital object is owned by The Des Moines Register; it may not be downloaded, reproduced, or distributed without written permission. For more information, contact the Special Collections Department.","Editorial Cartoons of Brian Duffy; Des Moines Register Cartoonists|Papers of Brian Duffy|Des Moines Register",,English,"Still image|Editorial cartoons",MSC916|duffy-890531|http://digital.lib.uiowa.edu/cdm/ref/collection/duffy/id/423,,,,,,,,,,,,,,,,,,,,,,,,,,,,,,,,,,,,,,,,,,,,,,,,"<a href=""http://digital.lib.uiowa.edu/cdm/ref/collection/duffy/id/423"" target=""_blank"">View this item in its source respository</a>",,,,,,,,,,,,,,,,,,,,,,,,,,,,,http://www.iowaheritage.org/files/original/21e32f1ed2a9f0d16528f3cb6d684d49.jpg,"Remote Item","Editorial Cartoons of Brian Duffy",1,0
