 




﻿"Item Id","Item URI","Dublin Core:Title","Dublin Core:Subject","Dublin Core:Description","Dublin Core:Creator","Dublin Core:Source","Dublin Core:Publisher","Dublin Core:Date","Dublin Core:Contributor","Dublin Core:Rights","Dublin Core:Relation","Dublin Core:Format","Dublin Core:Language","Dublin Core:Type","Dublin Core:Identifier","Dublin Core:Coverage","Item Type Metadata:Text","Item Type Metadata:Interviewer","Item Type Metadata:Interviewee","Item Type Metadata:Location","Item Type Metadata:Transcription","Item Type Metadata:Local URL","Item Type Metadata:Original Format","Item Type Metadata:Physical Dimensions","Item Type Metadata:Duration","Item Type Metadata:Compression","Item Type Metadata:Producer","Item Type Metadata:Director","Item Type Metadata:Bit Rate/Frequency","Item Type Metadata:Time Summary","Item Type Metadata:Email Body","Item Type Metadata:Subject Line","Item Type Metadata:From","Item Type Metadata:To","Item Type Metadata:CC","Item Type Metadata:BCC","Item Type Metadata:Number of Attachments","Item Type Metadata:Standards","Item Type Metadata:Objectives","Item Type Metadata:Materials","Item Type Metadata:Lesson Plan Text","Item Type Metadata:URL","Item Type Metadata:Event Type","Item Type Metadata:Participants","Item Type Metadata:Birth Date","Item Type Metadata:Birthplace","Item Type Metadata:Death Date","Item Type Metadata:Occupation","Item Type Metadata:Biographical Text","Item Type Metadata:Bibliography","Item Type Metadata:Digital Reproduction Information","Item Type Metadata:Repository","Item Type Metadata:Repository Collection","Item Type Metadata:Contact information.","Item Type Metadata:File Name","Item Type Metadata:Notes","Item Type Metadata:Digital item created","Item Type Metadata:Digital item modified","Item Type Metadata:Executive Orders","Item Type Metadata:Record Created","Item Type Metadata:Record Modified","Item Type Metadata:Transcription2","Item Type Metadata:Source URL","Omeka Legacy File:Additional Creator","Omeka Legacy File:Transcriber","Omeka Legacy File:Producer","Omeka Legacy File:Render Device","Omeka Legacy File:Render Details","Omeka Legacy File:Capture Date","Omeka Legacy File:Capture Device","Omeka Legacy File:Capture Details","Omeka Legacy File:Change History","Omeka Legacy File:Watermark","Omeka Legacy File:Encryption","Omeka Legacy File:Compression","Omeka Legacy File:Post Processing","Omeka Image File:Width","Omeka Image File:Height","Omeka Image File:Bit Depth","Omeka Image File:Channels","Omeka Image File:Exif String","Omeka Image File:Exif Array","Omeka Image File:IPTC String","Omeka Image File:IPTC Array","Omeka Video File:Bitrate","Omeka Video File:Duration","Omeka Video File:Sample Rate","Omeka Video File:Codec","Omeka Video File:Width","Omeka Video File:Height",tags,file,itemType,collection,public,featured
64426,http://www.iowaheritage.org/items/show/64426,"Bird sanctuary","Iraq -- Foreign relations -- Iran|Khomeini, Ruhollah|Iran|Iraq-Kuwait Crisis, 1990-1991|Fighter planes|1990-2000|Iran -- Foreign relations -- Iraq|War|Wars|Iraq|Airplanes|Pilots|Leaders","Iraq; Iran","Duffy, Brian, 1955-",,"University of Iowa. Libraries. Special Collections Dept.",1991-01|2011-04,,"Educational use only, no other permissions given. Copyright to this digital object is owned by The Des Moines Register; it may not be downloaded, reproduced, or distributed without written permission. For more information, contact the Special Collections Department.","Editorial Cartoons of Brian Duffy; Des Moines Register Cartoonists|Papers of Brian Duffy|Des Moines Register",,English,"Still image|Editorial cartoons","MSC916|duffy-9101xx-undated 3|http://digital.lib.uiowa.edu/cdm/ref/collection/duffy/id/264",,,,,,,,,,,,,,,,,,,,,,,,,,,,,,,,,,,,,,,,,,,,,,,,"<a href=""http://digital.lib.uiowa.edu/cdm/ref/collection/duffy/id/264"" target=""_blank"">View this item in its source respository</a>",,,,,,,,,,,,,,,,,,,,,,,,,,,,,http://www.iowaheritage.org/files/original/5b4c8b271f26c1efc3c977b6753986d4.jpg,"Remote Item","Editorial Cartoons of Brian Duffy",1,0
64428,http://www.iowaheritage.org/items/show/64428,War,"War|Iraq|Fighter planes|1990-2000|Wars|Oil|Airplanes|Pilots|Oil wells",,"Duffy, Brian, 1955-",,"University of Iowa. Libraries. Special Collections Dept.",1991-01|2011-04,,"Educational use only, no other permissions given. Copyright to this digital object is owned by The Des Moines Register; it may not be downloaded, reproduced, or distributed without written permission. For more information, contact the Special Collections Department.","Editorial Cartoons of Brian Duffy; Des Moines Register Cartoonists|Papers of Brian Duffy|Des Moines Register",,English,"Still image|Editorial cartoons","MSC916|duffy-9101xx-undated 5|http://digital.lib.uiowa.edu/cdm/ref/collection/duffy/id/266",,,,,,,,,,,,,,,,,,,,,,,,,,,,,,,,,,,,,,,,,,,,,,,,"<a href=""http://digital.lib.uiowa.edu/cdm/ref/collection/duffy/id/266"" target=""_blank"">View this item in its source respository</a>",,,,,,,,,,,,,,,,,,,,,,,,,,,,,http://www.iowaheritage.org/files/original/6ee911dfdd86a9c7cf6d03c79410563b.jpg,"Remote Item","Editorial Cartoons of Brian Duffy",1,0
64437,http://www.iowaheritage.org/items/show/64437,Conditions,"War|Hussein, Saddam, 1937-2006|Iraq|Bomb craters|1990-2000|Dictators|Dictatorships|Peace|United States -- Foreign relations -- Iraq|Presidents|Dictators|Doves|Bombs|Hiding|Trapdoors|Bomb shelters|Smoke|Ruins",,"Duffy, Brian, 1955-",,"University of Iowa. Libraries. Special Collections Dept.",1991-02-16|2011-04,,"Educational use only, no other permissions given. Copyright to this digital object is owned by The Des Moines Register; it may not be downloaded, reproduced, or distributed without written permission. For more information, contact the Special Collections Department.","Editorial Cartoons of Brian Duffy; Des Moines Register Cartoonists|Papers of Brian Duffy|Des Moines Register",,English,"Still image|Editorial cartoons",MSC916|duffy-910216|http://digital.lib.uiowa.edu/cdm/ref/collection/duffy/id/275,,,,,,,,,,,,,,,,,,,,,,,,,,,,,,,,,,,,,,,,,,,,,,,,"<a href=""http://digital.lib.uiowa.edu/cdm/ref/collection/duffy/id/275"" target=""_blank"">View this item in its source respository</a>",,,,,,,,,,,,,,,,,,,,,,,,,,,,,http://www.iowaheritage.org/files/original/e10ee79d98e7a99591c647dc0891378d.jpg,"Remote Item","Editorial Cartoons of Brian Duffy",1,0
64439,http://www.iowaheritage.org/items/show/64439,"Gorbachev's peace plan","Peace|?Azi?z, T?a?riq|Iraq|Missiles|1990-2000|War|Occupation|Resolutions|Gorbachev, Mikhail Sergeevich, 1931-|Men|Clouds|Smoke|Scarves","Aziz; Patriot","Duffy, Brian, 1955-",,"University of Iowa. Libraries. Special Collections Dept.",1991-02-20|2011-04,,"Educational use only, no other permissions given. Copyright to this digital object is owned by The Des Moines Register; it may not be downloaded, reproduced, or distributed without written permission. For more information, contact the Special Collections Department.","Editorial Cartoons of Brian Duffy; Des Moines Register Cartoonists|Papers of Brian Duffy|Des Moines Register",,English,"Still image|Editorial cartoons",MSC916|duffy-910220|http://digital.lib.uiowa.edu/cdm/ref/collection/duffy/id/277,,,,,,,,,,,,,,,,,,,,,,,,,,,,,,,,,,,,,,,,,,,,,,,,"<a href=""http://digital.lib.uiowa.edu/cdm/ref/collection/duffy/id/277"" target=""_blank"">View this item in its source respository</a>",,,,,,,,,,,,,,,,,,,,,,,,,,,,,http://www.iowaheritage.org/files/original/7db2075f53dd338ff98d99d397a976b1.jpg,"Remote Item","Editorial Cartoons of Brian Duffy",1,0
64442,http://www.iowaheritage.org/items/show/64442,"Iraqi army","Dictators|Hussein, Saddam, 1937-2006|Iraq|Dictators|1990-2000|Dictatorships|War|Soldiers|Campaigns & battles|Presidents|Men|Soldiers|Meat|Kitchens|Appliances","Ground war","Duffy, Brian, 1955-",,"University of Iowa. Libraries. Special Collections Dept.",1991-02-26|2011-04,,"Educational use only, no other permissions given. Copyright to this digital object is owned by The Des Moines Register; it may not be downloaded, reproduced, or distributed without written permission. For more information, contact the Special Collections Department.","Editorial Cartoons of Brian Duffy; Des Moines Register Cartoonists|Papers of Brian Duffy|Des Moines Register",,English,"Still image|Editorial cartoons",MSC916|duffy-910226|http://digital.lib.uiowa.edu/cdm/ref/collection/duffy/id/280,,,,,,,,,,,,,,,,,,,,,,,,,,,,,,,,,,,,,,,,,,,,,,,,"<a href=""http://digital.lib.uiowa.edu/cdm/ref/collection/duffy/id/280"" target=""_blank"">View this item in its source respository</a>",,,,,,,,,,,,,,,,,,,,,,,,,,,,,http://www.iowaheritage.org/files/original/d40ce63414d004710105f62c83c4cac3.jpg,"Remote Item","Editorial Cartoons of Brian Duffy",1,0
64470,http://www.iowaheritage.org/items/show/64470,"How many lives has he got left?","Presidents|Clinton, Bill, 1946-|Iraq|Presidents|1990-2000|United States -- Foreign relations -- Iraq|War|Dictators|Hussein, Saddam, 1937-2006|Christopher, Warren|Deserts|Smoke|Cats|Bandages|Bomb craters|Men",Saddam,"Duffy, Brian, 1955-",,"University of Iowa. Libraries. Special Collections Dept.",1995-04-06|2011-04,,"Educational use only, no other permissions given. Copyright to this digital object is owned by The Des Moines Register; it may not be downloaded, reproduced, or distributed without written permission. For more information, contact the Special Collections Department.","Editorial Cartoons of Brian Duffy; Des Moines Register Cartoonists|Papers of Brian Duffy|Des Moines Register",,English,"Still image|Editorial cartoons",MSC916|duffy-950406|http://digital.lib.uiowa.edu/cdm/ref/collection/duffy/id/308,,,,,,,,,,,,,,,,,,,,,,,,,,,,,,,,,,,,,,,,,,,,,,,,"<a href=""http://digital.lib.uiowa.edu/cdm/ref/collection/duffy/id/308"" target=""_blank"">View this item in its source respository</a>",,,,,,,,,,,,,,,,,,,,,,,,,,,,,http://www.iowaheritage.org/files/original/50837da179c32601d8fb34e18dc37afe.jpg,"Remote Item","Editorial Cartoons of Brian Duffy",1,0
64503,http://www.iowaheritage.org/items/show/64503,"Collateral damage","War|Clinton, Bill, 1946-|Iraq|Fighter planes|1990-2000|Bombing|Bombs|Republican Party|Partisanship|Impeachments|Presidents|Elephants|Smoke|Stars|Bombs","Desert fox; Impeachment hearings; @#*!!","Duffy, Brian, 1955-",,"University of Iowa. Libraries. Special Collections Dept.",1998-12-18|2011-04,,"Educational use only, no other permissions given. Copyright to this digital object is owned by The Des Moines Register; it may not be downloaded, reproduced, or distributed without written permission. For more information, contact the Special Collections Department.","Editorial Cartoons of Brian Duffy; Des Moines Register Cartoonists|Papers of Brian Duffy|Des Moines Register",,English,"Still image|Editorial cartoons",MSC916|duffy-981218|http://digital.lib.uiowa.edu/cdm/ref/collection/duffy/id/341,,,,,,,,,,,,,,,,,,,,,,,,,,,,,,,,,,,,,,,,,,,,,,,,"<a href=""http://digital.lib.uiowa.edu/cdm/ref/collection/duffy/id/341"" target=""_blank"">View this item in its source respository</a>",,,,,,,,,,,,,,,,,,,,,,,,,,,,,http://www.iowaheritage.org/files/original/1720e1f9121e51b1f0ba9cd7cdf7e034.jpg,"Remote Item","Editorial Cartoons of Brian Duffy",1,0
64592,http://www.iowaheritage.org/items/show/64592,SNAP,"Dictators|Hussein, Saddam, 1937-2006|Iraq|Dictators|1990-2000|Dictatorships|Weapons|Weapons of mass destruction|Nuclear weapons|Uniforms|Cookie jars|Mouse traps|Fingers|Stars",Iraq,"Duffy, Brian, 1955-",,"University of Iowa. Libraries. Special Collections Dept.",1990-03-30|2011-04,,"Educational use only, no other permissions given. Copyright to this digital object is owned by The Des Moines Register; it may not be downloaded, reproduced, or distributed without written permission. For more information, contact the Special Collections Department.","Editorial Cartoons of Brian Duffy; Des Moines Register Cartoonists|Papers of Brian Duffy|Des Moines Register",,English,"Still image|Editorial cartoons",MSC916|duffy-900330|http://digital.lib.uiowa.edu/cdm/ref/collection/duffy/id/430,,,,,,,,,,,,,,,,,,,,,,,,,,,,,,,,,,,,,,,,,,,,,,,,"<a href=""http://digital.lib.uiowa.edu/cdm/ref/collection/duffy/id/430"" target=""_blank"">View this item in its source respository</a>",,,,,,,,,,,,,,,,,,,,,,,,,,,,,http://www.iowaheritage.org/files/original/9871e8157c22542863f2bdbb2a364a51.jpg,"Remote Item","Editorial Cartoons of Brian Duffy",1,0
64615,http://www.iowaheritage.org/items/show/64615,Iraq,"Dictators|Hussein, Saddam, 1937-2006|Iraq|Iraq-Kuwait Crisis, 1990-1991|Dictators|1990-2000|Aggression|Conquest|War|Kuwait|Guns|Smoke|Deserts|Men",Kuwait,"Duffy, Brian, 1955-",,"University of Iowa. Libraries. Special Collections Dept.",1990-08-03|2011-04,,"Educational use only, no other permissions given. Copyright to this digital object is owned by The Des Moines Register; it may not be downloaded, reproduced, or distributed without written permission. For more information, contact the Special Collections Department.","Editorial Cartoons of Brian Duffy; Des Moines Register Cartoonists|Papers of Brian Duffy|Des Moines Register",,English,"Still image|Editorial cartoons",MSC916|duffy-900803|http://digital.lib.uiowa.edu/cdm/ref/collection/duffy/id/453,,,,,,,,,,,,,,,,,,,,,,,,,,,,,,,,,,,,,,,,,,,,,,,,"<a href=""http://digital.lib.uiowa.edu/cdm/ref/collection/duffy/id/453"" target=""_blank"">View this item in its source respository</a>",,,,,,,,,,,,,,,,,,,,,,,,,,,,,http://www.iowaheritage.org/files/original/45530c0d00572f7f489b2f5285cd56f9.jpg,"Remote Item","Editorial Cartoons of Brian Duffy",1,0
64618,http://www.iowaheritage.org/items/show/64618,"An appetizer","Dictators|Hussein, Saddam, 1937-2006|Iraq|Dictators|1990-2000|Dictatorships|Ambition|Foreign relations|War|Middle East|Kuwait|Eating & drinking|Knives|Food|Forks","Hussein; Kuwait; Middle East","Duffy, Brian, 1955-",,"University of Iowa. Libraries. Special Collections Dept.",1990-08-07|2011-04,,"Educational use only, no other permissions given. Copyright to this digital object is owned by The Des Moines Register; it may not be downloaded, reproduced, or distributed without written permission. For more information, contact the Special Collections Department.","Editorial Cartoons of Brian Duffy; Des Moines Register Cartoonists|Papers of Brian Duffy|Des Moines Register",,English,"Still image|Editorial cartoons",MSC916|duffy-900807|http://digital.lib.uiowa.edu/cdm/ref/collection/duffy/id/456,,,,,,,,,,,,,,,,,,,,,,,,,,,,,,,,,,,,,,,,,,,,,,,,"<a href=""http://digital.lib.uiowa.edu/cdm/ref/collection/duffy/id/456"" target=""_blank"">View this item in its source respository</a>",,,,,,,,,,,,,,,,,,,,,,,,,,,,,http://www.iowaheritage.org/files/original/a3f5a44cf0f583f56edb4967dd7954c6.jpg,"Remote Item","Editorial Cartoons of Brian Duffy",1,0
