 




﻿"Item Id","Item URI","Dublin Core:Title","Dublin Core:Subject","Dublin Core:Description","Dublin Core:Creator","Dublin Core:Source","Dublin Core:Publisher","Dublin Core:Date","Dublin Core:Contributor","Dublin Core:Rights","Dublin Core:Relation","Dublin Core:Format","Dublin Core:Language","Dublin Core:Type","Dublin Core:Identifier","Dublin Core:Coverage","Item Type Metadata:Text","Item Type Metadata:Interviewer","Item Type Metadata:Interviewee","Item Type Metadata:Location","Item Type Metadata:Transcription","Item Type Metadata:Local URL","Item Type Metadata:Original Format","Item Type Metadata:Physical Dimensions","Item Type Metadata:Duration","Item Type Metadata:Compression","Item Type Metadata:Producer","Item Type Metadata:Director","Item Type Metadata:Bit Rate/Frequency","Item Type Metadata:Time Summary","Item Type Metadata:Email Body","Item Type Metadata:Subject Line","Item Type Metadata:From","Item Type Metadata:To","Item Type Metadata:CC","Item Type Metadata:BCC","Item Type Metadata:Number of Attachments","Item Type Metadata:Standards","Item Type Metadata:Objectives","Item Type Metadata:Materials","Item Type Metadata:Lesson Plan Text","Item Type Metadata:URL","Item Type Metadata:Event Type","Item Type Metadata:Participants","Item Type Metadata:Birth Date","Item Type Metadata:Birthplace","Item Type Metadata:Death Date","Item Type Metadata:Occupation","Item Type Metadata:Biographical Text","Item Type Metadata:Bibliography","Item Type Metadata:Digital Reproduction Information","Item Type Metadata:Repository","Item Type Metadata:Repository Collection","Item Type Metadata:Contact information.","Item Type Metadata:File Name","Item Type Metadata:Notes","Item Type Metadata:Digital item created","Item Type Metadata:Digital item modified","Item Type Metadata:Executive Orders","Item Type Metadata:Record Created","Item Type Metadata:Record Modified","Item Type Metadata:Transcription2","Item Type Metadata:Source URL","Omeka Legacy File:Additional Creator","Omeka Legacy File:Transcriber","Omeka Legacy File:Producer","Omeka Legacy File:Render Device","Omeka Legacy File:Render Details","Omeka Legacy File:Capture Date","Omeka Legacy File:Capture Device","Omeka Legacy File:Capture Details","Omeka Legacy File:Change History","Omeka Legacy File:Watermark","Omeka Legacy File:Encryption","Omeka Legacy File:Compression","Omeka Legacy File:Post Processing","Omeka Image File:Width","Omeka Image File:Height","Omeka Image File:Bit Depth","Omeka Image File:Channels","Omeka Image File:Exif String","Omeka Image File:Exif Array","Omeka Image File:IPTC String","Omeka Image File:IPTC Array","Omeka Video File:Bitrate","Omeka Video File:Duration","Omeka Video File:Sample Rate","Omeka Video File:Codec","Omeka Video File:Width","Omeka Video File:Height",tags,file,itemType,collection,public,featured
64382,http://www.iowaheritage.org/items/show/64382,"Chop thwack","Marijuana|Harkin, Tom|Iowa|Men|1980-1990|Regulation|Senate|Congress|Government|Government regulation|Lumberjacks|Axes|Marijuana|Signs","Sen. Harkin; Marijuana national forest","Duffy, Brian, 1955-",,"University of Iowa. Libraries. Special Collections Dept.",1988-05-15|2011-04,,"Educational use only, no other permissions given. Copyright to this digital object is owned by The Des Moines Register; it may not be downloaded, reproduced, or distributed without written permission. For more information, contact the Special Collections Department.","Editorial Cartoons of Brian Duffy; Des Moines Register Cartoonists|Papers of Brian Duffy|Des Moines Register",,English,"Still image|Editorial cartoons",MSC916|duffy-880515|http://digital.lib.uiowa.edu/cdm/ref/collection/duffy/id/220,,,,,,,,,,,,,,,,,,,,,,,,,,,,,,,,,,,,,,,,,,,,,,,,"<a href=""http://digital.lib.uiowa.edu/cdm/ref/collection/duffy/id/220"" target=""_blank"">View this item in its source respository</a>",,,,,,,,,,,,,,,,,,,,,,,,,,,,,http://www.iowaheritage.org/files/original/66ff56cdff0210c64a3e9b6ab611db79.jpg,"Remote Item","Editorial Cartoons of Brian Duffy",1,0
64383,http://www.iowaheritage.org/items/show/64383,"Take a number","Supreme Court|United States|Yards|1980-1990|Police|Right of property|Privacy|Suspicion|Police raids|Fences|Moon|Policemen|Dogs|Raccoons|Garbage|Garbage cans|Newspaper headlines|Newspapers","Supreme Court ok's garbage search by police","Duffy, Brian, 1955-",,"University of Iowa. Libraries. Special Collections Dept.",1988-05-22|2011-04,,"Educational use only, no other permissions given. Copyright to this digital object is owned by The Des Moines Register; it may not be downloaded, reproduced, or distributed without written permission. For more information, contact the Special Collections Department.","Editorial Cartoons of Brian Duffy; Des Moines Register Cartoonists|Papers of Brian Duffy|Des Moines Register",,English,"Still image|Editorial cartoons",MSC916|duffy-880522|http://digital.lib.uiowa.edu/cdm/ref/collection/duffy/id/221,,,,,,,,,,,,,,,,,,,,,,,,,,,,,,,,,,,,,,,,,,,,,,,,"<a href=""http://digital.lib.uiowa.edu/cdm/ref/collection/duffy/id/221"" target=""_blank"">View this item in its source respository</a>",,,,,,,,,,,,,,,,,,,,,,,,,,,,,http://www.iowaheritage.org/files/original/c86e377c65b4f56e4aa6c068d92cfdaf.jpg,"Remote Item","Editorial Cartoons of Brian Duffy",1,0
64384,http://www.iowaheritage.org/items/show/64384,"Duke & the right stuff","Campaigns|Dukakis, Michael S. (Michael Stanley), 1933-|United States|Men|1980-1990|Politicians|Politics|Presidency|Candidates|Bradley, Bill, 1943-|Jackson, Jesse, 1941-|Glenn, John, 1921-|Politicians|Stars|Papers|Athletes|Preachers|Astronauts|Governors|Candidates","Too tall; Bill Bradley; V.P. list; Too charismatic; Jesse; Just right; John Glenn","Duffy, Brian, 1955-",,"University of Iowa. Libraries. Special Collections Dept.",1988-05-24|2011-04,,"Educational use only, no other permissions given. Copyright to this digital object is owned by The Des Moines Register; it may not be downloaded, reproduced, or distributed without written permission. For more information, contact the Special Collections Department.","Editorial Cartoons of Brian Duffy; Des Moines Register Cartoonists|Papers of Brian Duffy|Des Moines Register",,English,"Still image|Editorial cartoons",MSC916|duffy-880524|http://digital.lib.uiowa.edu/cdm/ref/collection/duffy/id/222,,,,,,,,,,,,,,,,,,,,,,,,,,,,,,,,,,,,,,,,,,,,,,,,"<a href=""http://digital.lib.uiowa.edu/cdm/ref/collection/duffy/id/222"" target=""_blank"">View this item in its source respository</a>",,,,,,,,,,,,,,,,,,,,,,,,,,,,,http://www.iowaheritage.org/files/original/0106103b36bf0304cb2e9fc8b0b1c0ba.jpg,"Remote Item","Editorial Cartoons of Brian Duffy",1,0
64385,http://www.iowaheritage.org/items/show/64385,"Helms treaty tailoring & alterations","Senate|Reagan, Ronald|United States|Signs|1980-1990|Presidents|Treaties|Foreign relations|Foreign policy|Foreign travel|United States -- Foreign relations -- Soviet Union|Helms, Jesse|Presidents|Tailors|Pins & needles|Pants|Men|Suitcases|Counters|Chauffeurs|Watches|Automobiles|Windows","Well, they ain't ready yet; Moscow","Duffy, Brian, 1955-",,"University of Iowa. Libraries. Special Collections Dept.",1988-05-25|2011-04,,"Educational use only, no other permissions given. Copyright to this digital object is owned by The Des Moines Register; it may not be downloaded, reproduced, or distributed without written permission. For more information, contact the Special Collections Department.","Editorial Cartoons of Brian Duffy; Des Moines Register Cartoonists|Papers of Brian Duffy|Des Moines Register",,English,"Still image|Editorial cartoons",MSC916|duffy-880525|http://digital.lib.uiowa.edu/cdm/ref/collection/duffy/id/223,,,,,,,,,,,,,,,,,,,,,,,,,,,,,,,,,,,,,,,,,,,,,,,,"<a href=""http://digital.lib.uiowa.edu/cdm/ref/collection/duffy/id/223"" target=""_blank"">View this item in its source respository</a>",,,,,,,,,,,,,,,,,,,,,,,,,,,,,http://www.iowaheritage.org/files/original/bce66888d96ca5b436a5f8e720723f3c.jpg,"Remote Item","Editorial Cartoons of Brian Duffy",1,0
64386,http://www.iowaheritage.org/items/show/64386,"The show must go on!","Television broadcasting|Swaggart, Jimmy|United States|Televisions|1980-1990|Evangelists|Corruption|Religion|Religious leaders|Religious right|Men|Preachers|Stars|Books|Ledgers|Sweating","Swaggart; Ledger; 1-800-555-CASH","Duffy, Brian, 1955-",,"University of Iowa. Libraries. Special Collections Dept.",1988-05-26|2011-04,,"Educational use only, no other permissions given. Copyright to this digital object is owned by The Des Moines Register; it may not be downloaded, reproduced, or distributed without written permission. For more information, contact the Special Collections Department.","Editorial Cartoons of Brian Duffy; Des Moines Register Cartoonists|Papers of Brian Duffy|Des Moines Register",,English,"Still image|Editorial cartoons",MSC916|duffy-880526|http://digital.lib.uiowa.edu/cdm/ref/collection/duffy/id/224,,,,,,,,,,,,,,,,,,,,,,,,,,,,,,,,,,,,,,,,,,,,,,,,"<a href=""http://digital.lib.uiowa.edu/cdm/ref/collection/duffy/id/224"" target=""_blank"">View this item in its source respository</a>",,,,,,,,,,,,,,,,,,,,,,,,,,,,,http://www.iowaheritage.org/files/original/beb8ef3a19e29ee3d152c12bfbdd3cc5.jpg,"Remote Item","Editorial Cartoons of Brian Duffy",1,0
64387,http://www.iowaheritage.org/items/show/64387,"Happy 25 anniversary Organization of African States","Famine|Ethiopia|Tables|1980-1990|Starvation|Political corruption|Politics|Militarism|Children|Poverty|Africa|Men|Children|Birthday cakes|Wine|Glassware|Soldiers|Plates|Bowls|Candles|Toasting|Starvation",Ethiopia,"Duffy, Brian, 1955-",,"University of Iowa. Libraries. Special Collections Dept.",1988-05-27|2011-04,,"Educational use only, no other permissions given. Copyright to this digital object is owned by The Des Moines Register; it may not be downloaded, reproduced, or distributed without written permission. For more information, contact the Special Collections Department.","Editorial Cartoons of Brian Duffy; Des Moines Register Cartoonists|Papers of Brian Duffy|Des Moines Register",,English,"Still image|Editorial cartoons",MSC916|duffy-880527|http://digital.lib.uiowa.edu/cdm/ref/collection/duffy/id/225,,,,,,,,,,,,,,,,,,,,,,,,,,,,,,,,,,,,,,,,,,,,,,,,"<a href=""http://digital.lib.uiowa.edu/cdm/ref/collection/duffy/id/225"" target=""_blank"">View this item in its source respository</a>",,,,,,,,,,,,,,,,,,,,,,,,,,,,,http://www.iowaheritage.org/files/original/e15f5025d054876b3db842711c4f65de.jpg,"Remote Item","Editorial Cartoons of Brian Duffy",1,0
64388,http://www.iowaheritage.org/items/show/64388,"I'm not going to pick on an invalid","Presidents|Reagan, Ronald|United States|Presidents|1980-1990|Presidency|Lame ducks|Politics|Politicians|Ducks|Crutches|Fractures (Bones)|Medical equipment & suppplies",,"Duffy, Brian, 1955-",,"University of Iowa. Libraries. Special Collections Dept.",1988-05|2011-04,,"Educational use only, no other permissions given. Copyright to this digital object is owned by The Des Moines Register; it may not be downloaded, reproduced, or distributed without written permission. For more information, contact the Special Collections Department.","Editorial Cartoons of Brian Duffy; Des Moines Register Cartoonists|Papers of Brian Duffy|Des Moines Register",,English,"Still image|Editorial cartoons","MSC916|duffy-8805xx-undated 1|http://digital.lib.uiowa.edu/cdm/ref/collection/duffy/id/226",,,,,,,,,,,,,,,,,,,,,,,,,,,,,,,,,,,,,,,,,,,,,,,,"<a href=""http://digital.lib.uiowa.edu/cdm/ref/collection/duffy/id/226"" target=""_blank"">View this item in its source respository</a>",,,,,,,,,,,,,,,,,,,,,,,,,,,,,http://www.iowaheritage.org/files/original/ba334fab1a02321db129e255f190b744.jpg,"Remote Item","Editorial Cartoons of Brian Duffy",1,0
64389,http://www.iowaheritage.org/items/show/64389,"Iraq Iran","War|Iraq|Bombs|1980-1990|Wars|Iran -- Foreign relations -- Iraq|Iraq -- Foreign relations -- Iran|United Nations|United States -- Foreign relations|Iran|Missiles|Traffic signs & signals|War|Soldiers|Cities|Smoke","Stop; U.N.","Duffy, Brian, 1955-",,"University of Iowa. Libraries. Special Collections Dept.",1988-05|2011-04,,"Educational use only, no other permissions given. Copyright to this digital object is owned by The Des Moines Register; it may not be downloaded, reproduced, or distributed without written permission. For more information, contact the Special Collections Department.","Editorial Cartoons of Brian Duffy; Des Moines Register Cartoonists|Papers of Brian Duffy|Des Moines Register",,English,"Still image|Editorial cartoons","MSC916|duffy-8805xx-undated 3|http://digital.lib.uiowa.edu/cdm/ref/collection/duffy/id/227",,,,,,,,,,,,,,,,,,,,,,,,,,,,,,,,,,,,,,,,,,,,,,,,"<a href=""http://digital.lib.uiowa.edu/cdm/ref/collection/duffy/id/227"" target=""_blank"">View this item in its source respository</a>",,,,,,,,,,,,,,,,,,,,,,,,,,,,,http://www.iowaheritage.org/files/original/c012584a44943c9959eccac2967dd946.jpg,"Remote Item","Editorial Cartoons of Brian Duffy",1,0
64390,http://www.iowaheritage.org/items/show/64390,"To Ollie : do not open until Christmas","Presidents|North, Oliver|United States|Men|1980-1990|Pardon|Crimes|Criminals|Crimes and punishment|Smuggling|Military|Military aid|Arms|Guerillas|Scandal|Reagan, Ronald|Soldiers|Packages|Doors|Doorsteps|Gifts|Cameras|Fences|Barbed wire","Rattle ... rattle; 602; The Presidential Pardon Co. 1600 Pennsylvania Ave. Washington, D.C.","Duffy, Brian, 1955-",,"University of Iowa. Libraries. Special Collections Dept.",1988-05|2011-04,,"Educational use only, no other permissions given. Copyright to this digital object is owned by The Des Moines Register; it may not be downloaded, reproduced, or distributed without written permission. For more information, contact the Special Collections Department.","Editorial Cartoons of Brian Duffy; Des Moines Register Cartoonists|Papers of Brian Duffy|Des Moines Register",,English,"Still image|Editorial cartoons","MSC916|duffy-8805xx-undated 3|http://digital.lib.uiowa.edu/cdm/ref/collection/duffy/id/228",,,,,,,,,,,,,,,,,,,,,,,,,,,,,,,,,,,,,,,,,,,,,,,,"<a href=""http://digital.lib.uiowa.edu/cdm/ref/collection/duffy/id/228"" target=""_blank"">View this item in its source respository</a>",,,,,,,,,,,,,,,,,,,,,,,,,,,,,http://www.iowaheritage.org/files/original/2589e42e3858a90812a1042127579278.jpg,"Remote Item","Editorial Cartoons of Brian Duffy",1,0
64391,http://www.iowaheritage.org/items/show/64391,"Clank clank","Presidents|Meese, Edwin|United States|Presidents|1980-1990|Lawyers|Administration|Administrative responsibility|Policy|Bush, George, 1924-|Men|Running|Track athletics|Tracks|Buckets","Meese; Administration policies","Duffy, Brian, 1955-",,"University of Iowa. Libraries. Special Collections Dept.",1988-05|2011-04,,"Educational use only, no other permissions given. Copyright to this digital object is owned by The Des Moines Register; it may not be downloaded, reproduced, or distributed without written permission. For more information, contact the Special Collections Department.","Editorial Cartoons of Brian Duffy; Des Moines Register Cartoonists|Papers of Brian Duffy|Des Moines Register",,English,"Still image|Editorial cartoons","MSC916|duffy-8805xx-undated 4|http://digital.lib.uiowa.edu/cdm/ref/collection/duffy/id/229",,,,,,,,,,,,,,,,,,,,,,,,,,,,,,,,,,,,,,,,,,,,,,,,"<a href=""http://digital.lib.uiowa.edu/cdm/ref/collection/duffy/id/229"" target=""_blank"">View this item in its source respository</a>",,,,,,,,,,,,,,,,,,,,,,,,,,,,,http://www.iowaheritage.org/files/original/6502f3d4fea6e09b40b273e3f5c56abe.jpg,"Remote Item","Editorial Cartoons of Brian Duffy",1,0
