 




﻿"Item Id","Item URI","Dublin Core:Title","Dublin Core:Subject","Dublin Core:Description","Dublin Core:Creator","Dublin Core:Source","Dublin Core:Publisher","Dublin Core:Date","Dublin Core:Contributor","Dublin Core:Rights","Dublin Core:Relation","Dublin Core:Format","Dublin Core:Language","Dublin Core:Type","Dublin Core:Identifier","Dublin Core:Coverage","Item Type Metadata:Text","Item Type Metadata:Interviewer","Item Type Metadata:Interviewee","Item Type Metadata:Location","Item Type Metadata:Transcription","Item Type Metadata:Local URL","Item Type Metadata:Original Format","Item Type Metadata:Physical Dimensions","Item Type Metadata:Duration","Item Type Metadata:Compression","Item Type Metadata:Producer","Item Type Metadata:Director","Item Type Metadata:Bit Rate/Frequency","Item Type Metadata:Time Summary","Item Type Metadata:Email Body","Item Type Metadata:Subject Line","Item Type Metadata:From","Item Type Metadata:To","Item Type Metadata:CC","Item Type Metadata:BCC","Item Type Metadata:Number of Attachments","Item Type Metadata:Standards","Item Type Metadata:Objectives","Item Type Metadata:Materials","Item Type Metadata:Lesson Plan Text","Item Type Metadata:URL","Item Type Metadata:Event Type","Item Type Metadata:Participants","Item Type Metadata:Birth Date","Item Type Metadata:Birthplace","Item Type Metadata:Death Date","Item Type Metadata:Occupation","Item Type Metadata:Biographical Text","Item Type Metadata:Bibliography","Item Type Metadata:Digital Reproduction Information","Item Type Metadata:Repository","Item Type Metadata:Repository Collection","Item Type Metadata:Contact information.","Item Type Metadata:File Name","Item Type Metadata:Notes","Item Type Metadata:Digital item created","Item Type Metadata:Digital item modified","Item Type Metadata:Executive Orders","Item Type Metadata:Record Created","Item Type Metadata:Record Modified","Item Type Metadata:Transcription2","Item Type Metadata:Source URL","Omeka Legacy File:Additional Creator","Omeka Legacy File:Transcriber","Omeka Legacy File:Producer","Omeka Legacy File:Render Device","Omeka Legacy File:Render Details","Omeka Legacy File:Capture Date","Omeka Legacy File:Capture Device","Omeka Legacy File:Capture Details","Omeka Legacy File:Change History","Omeka Legacy File:Watermark","Omeka Legacy File:Encryption","Omeka Legacy File:Compression","Omeka Legacy File:Post Processing","Omeka Image File:Width","Omeka Image File:Height","Omeka Image File:Bit Depth","Omeka Image File:Channels","Omeka Image File:Exif String","Omeka Image File:Exif Array","Omeka Image File:IPTC String","Omeka Image File:IPTC Array","Omeka Video File:Bitrate","Omeka Video File:Duration","Omeka Video File:Sample Rate","Omeka Video File:Codec","Omeka Video File:Width","Omeka Video File:Height",tags,file,itemType,collection,public,featured
12617,http://www.iowaheritage.org/items/show/12617,"Allison, Iowa. CGW","Railroad stations|Chicago Great Western Railroad Company|United States -- Iowa -- Butler County -- Allison|1950-1960|Buildings|Railroad signals","Single story wooden depot with signal on tall pole.",unknown,,"University of Iowa. Libraries. Special Collections Dept.",1954-05-10|2005-09-13,,"Educational use only, no other permissions given. U.S. and international copyright laws may protect this digital image. Commercial use or distribution of the image is not permitted without prior permission of the copyright holder. For information see:  http://www.lib.uiowa.edu/spec-coll/help/copyright.html","John P. Vander Maas Railroadiana|John P. Vander Maas Railroadiana Collection|MSC0468|http://lib.uiowa.edu/collguides/?MSC0468|Vol. 40, Depots by county",8|11,,"Still image|Photographs|jpeg",40allison01.jpg|169946290|https://digital.lib.uiowa.edu/,,,,,,,,,,,,,,,,,,,,,,,,,,,,,,,,,,,,,,,,,,,,,,,,"<a href=""https://digital.lib.uiowa.edu/"" target=""_blank"">View this item in its source respository</a>",,,,,,,,,,,,,,,,,,,,,,,,,,,,,http://www.iowaheritage.org/files/original/4095b18565b522caa5c4aab18a401f4d.jpg,"Remote Item","John P. Vander Maas Railroadiana",1,0
12619,http://www.iowaheritage.org/items/show/12619,"Aplington, Iowa. IC","Railroad stations|Illinois Central Railroad Company|United States -- Iowa -- Butler County -- Aplington|1950-1960|Buildings","Single story wooden depot with double door.  Buildings nearby.",unknown,,"University of Iowa. Libraries. Special Collections Dept.",1958-10-12|2005-09-13,,"Educational use only, no other permissions given. U.S. and international copyright laws may protect this digital image. Commercial use or distribution of the image is not permitted without prior permission of the copyright holder. For information see:  http://www.lib.uiowa.edu/spec-coll/help/copyright.html","John P. Vander Maas Railroadiana|John P. Vander Maas Railroadiana Collection|MSC0468|http://lib.uiowa.edu/collguides/?MSC0468|Vol. 40, Depots by county",8|12,,"Still image|Photographs|jpeg",40aplington01.jpg|169946290|https://digital.lib.uiowa.edu/,,,,,,,,,,,,,,,,,,,,,,,,,,,,,,,,,,,,,,,,,,,,,,,,"<a href=""https://digital.lib.uiowa.edu/"" target=""_blank"">View this item in its source respository</a>",,,,,,,,,,,,,,,,,,,,,,,,,,,,,http://www.iowaheritage.org/files/original/c13369dd658b6b12767e1c7ceef54e5d.jpg,"Remote Item","John P. Vander Maas Railroadiana",1,0
12621,http://www.iowaheritage.org/items/show/12621,"Aredale, Iowa. CNW","Railroad stations|Chicago and North Western Railway Company|United States -- Iowa -- Butler County -- Aredale|1950-1960|Buildings|Railroad signals","Small, single story wooden depot with signal on pole and other outbuildings.",unknown,,"University of Iowa. Libraries. Special Collections Dept.",1959-05-10|2005-09-13,,"Educational use only, no other permissions given. U.S. and international copyright laws may protect this digital image. Commercial use or distribution of the image is not permitted without prior permission of the copyright holder. For information see:  http://www.lib.uiowa.edu/spec-coll/help/copyright.html","John P. Vander Maas Railroadiana|John P. Vander Maas Railroadiana Collection|MSC0468|http://lib.uiowa.edu/collguides/?MSC0468|Vol. 40, Depots by county",8|11,,"Still image|Photographs|jpeg",40aredale01.jpg|169946290|https://digital.lib.uiowa.edu/,,,,,,,,,,,,,,,,,,,,,,,,,,,,,,,,,,,,,,,,,,,,,,,,"<a href=""https://digital.lib.uiowa.edu/"" target=""_blank"">View this item in its source respository</a>",,,,,,,,,,,,,,,,,,,,,,,,,,,,,http://www.iowaheritage.org/files/original/2305003fbfc260e647f072dea0cade7c.jpg,"Remote Item","John P. Vander Maas Railroadiana",1,0
12623,http://www.iowaheritage.org/items/show/12623,"Austinville, Iowa. IC","Railroad stations|Illinois Central Railroad Company|United States -- Iowa -- Butler County -- Austinville|1950-1960|Buildings","Small, single story wooden depot with house behind it.  Two sets of tracks running in front of depot.",unknown,,"University of Iowa. Libraries. Special Collections Dept.",1958-10-12|2005-09-13,,"Educational use only, no other permissions given. U.S. and international copyright laws may protect this digital image. Commercial use or distribution of the image is not permitted without prior permission of the copyright holder. For information see:  http://www.lib.uiowa.edu/spec-coll/help/copyright.html","John P. Vander Maas Railroadiana|John P. Vander Maas Railroadiana Collection|MSC0468|http://lib.uiowa.edu/collguides/?MSC0468|Vol. 40, Depots by county",8|11,,"Still image|Photographs|jpeg",40austinville01.jpg|169946290|https://digital.lib.uiowa.edu/,,,,,,,,,,,,,,,,,,,,,,,,,,,,,,,,,,,,,,,,,,,,,,,,"<a href=""https://digital.lib.uiowa.edu/"" target=""_blank"">View this item in its source respository</a>",,,,,,,,,,,,,,,,,,,,,,,,,,,,,http://www.iowaheritage.org/files/original/442a9f2023fe411000a80e0445083328.jpg,"Remote Item","John P. Vander Maas Railroadiana",1,0
12625,http://www.iowaheritage.org/items/show/12625,"Bristow, Iowa. CGW","Railroad stations|Chicago Great Western Railroad Company|United States -- Iowa -- Butler County -- Bristow|1950-1960|Buildings",,unknown,,"University of Iowa. Libraries. Special Collections Dept.",1959-05-10|2005-09-13,,"Educational use only, no other permissions given. U.S. and international copyright laws may protect this digital image. Commercial use or distribution of the image is not permitted without prior permission of the copyright holder. For information see:  http://www.lib.uiowa.edu/spec-coll/help/copyright.html","John P. Vander Maas Railroadiana|John P. Vander Maas Railroadiana Collection|MSC0468|http://lib.uiowa.edu/collguides/?MSC0468|Vol. 40, Depots by county",8|11,,"Still image|Photographs|jpeg",40bristow01.jpg|169946290|https://digital.lib.uiowa.edu/,,,,,,,,,,,,,,,,,,,,,,,,,,,,,,,,,,,,,,,,,,,,,,,,"<a href=""https://digital.lib.uiowa.edu/"" target=""_blank"">View this item in its source respository</a>",,,,,,,,,,,,,,,,,,,,,,,,,,,,,http://www.iowaheritage.org/files/original/8c1641012d9e2f5b7ddbca2be5dcc985.jpg,"Remote Item","John P. Vander Maas Railroadiana",1,0
12627,http://www.iowaheritage.org/items/show/12627,"Clarksville, Iowa. CGW","Railroad stations|Chicago Great Western Railroad Company|United States -- Iowa -- Butler County -- Clarksville|1950-1960|Buildings|Railroad signals","Single story depot with signal on pole and houses in the background.",unknown,,"University of Iowa. Libraries. Special Collections Dept.",1959-05-10|2005-09-13,,"Educational use only, no other permissions given. U.S. and international copyright laws may protect this digital image. Commercial use or distribution of the image is not permitted without prior permission of the copyright holder. For information see:  http://www.lib.uiowa.edu/spec-coll/help/copyright.html","John P. Vander Maas Railroadiana|John P. Vander Maas Railroadiana Collection|MSC0468|http://lib.uiowa.edu/collguides/?MSC0468|Vol. 40, Depots by county",8|11,,"Still image|Photographs|jpeg",40clarksville01.jpg|169946290|https://digital.lib.uiowa.edu/,,,,,,,,,,,,,,,,,,,,,,,,,,,,,,,,,,,,,,,,,,,,,,,,"<a href=""https://digital.lib.uiowa.edu/"" target=""_blank"">View this item in its source respository</a>",,,,,,,,,,,,,,,,,,,,,,,,,,,,,http://www.iowaheritage.org/files/original/12298a03dccb4d61d6b846c134e0df62.jpg,"Remote Item","John P. Vander Maas Railroadiana",1,0
12629,http://www.iowaheritage.org/items/show/12629,"Clarksville, Iowa. CRIP","Railroad stations|Chicago, Rock Island & Pacific Rail Road Co.|United States -- Iowa -- Butler County -- Clarksville|1950-1960|Buildings|Railroad signals","Two story wooden depot with signal pole.",unknown,,"University of Iowa. Libraries. Special Collections Dept.",1959-05-10|2005-09-13,,"Educational use only, no other permissions given. U.S. and international copyright laws may protect this digital image. Commercial use or distribution of the image is not permitted without prior permission of the copyright holder. For information see:  http://www.lib.uiowa.edu/spec-coll/help/copyright.html","John P. Vander Maas Railroadiana|John P. Vander Maas Railroadiana Collection|MSC0468|http://lib.uiowa.edu/collguides/?MSC0468|Vol. 40, Depots by county",8|12,,"Still image|Photographs|jpeg",40clarksville02.jpg|169946290|https://digital.lib.uiowa.edu/,,,,,,,,,,,,,,,,,,,,,,,,,,,,,,,,,,,,,,,,,,,,,,,,"<a href=""https://digital.lib.uiowa.edu/"" target=""_blank"">View this item in its source respository</a>",,,,,,,,,,,,,,,,,,,,,,,,,,,,,http://www.iowaheritage.org/files/original/658d29de389df955ab35fbb2bd739828.jpg,"Remote Item","John P. Vander Maas Railroadiana",1,0
12631,http://www.iowaheritage.org/items/show/12631,"Dumont, Iowa. CGW","Railroad stations|Chicago Great Western Railroad Company|United States -- Iowa -- Butler County -- Dumont|1960-1970|Railroad cars","Train cars on tracks.  Sign for Dumont.  Gas tanks parked near tracks. ""View looks W at way freight just leaving town.  Photographed by: Ronald D. Sims, 2717 Cornell St. Des Moines, Iowa 50313""--Photograph verso.","Sims, Ronald D.",,"University of Iowa. Libraries. Special Collections Dept.",1968-03-23|2005-09-13,,"Educational use only, no other permissions given. U.S. and international copyright laws may protect this digital image. Commercial use or distribution of the image is not permitted without prior permission of the copyright holder. For information see:  http://www.lib.uiowa.edu/spec-coll/help/copyright.html","John P. Vander Maas Railroadiana|John P. Vander Maas Railroadiana Collection|MSC0468|http://lib.uiowa.edu/collguides/?MSC0468|Vol. 40, Depots by county",8|12,,"Still image|Photographs|jpeg",40dumont02.jpg|169946290|https://digital.lib.uiowa.edu/,,,,,,,,,,,,,,,,,,,,,,,,,,,,,,,,,,,,,,,,,,,,,,,,"<a href=""https://digital.lib.uiowa.edu/"" target=""_blank"">View this item in its source respository</a>",,,,,,,,,,,,,,,,,,,,,,,,,,,,,http://www.iowaheritage.org/files/original/f33a80e039b592537ee26189caf03479.jpg,"Remote Item","John P. Vander Maas Railroadiana",1,0
12633,http://www.iowaheritage.org/items/show/12633,"Greene, Iowa. CRIP","Railroad stations|Chicago, Rock Island & Pacific Rail Road Co.|United States -- Iowa -- Butler County -- Greene|1950-1960|Buildings|Railroad signals|Railroad cars","Two story wooden depot with signal on tall pole and railroad car on track.",unknown,,"University of Iowa. Libraries. Special Collections Dept.",1959-05-10|2005-09-13,,"Educational use only, no other permissions given. U.S. and international copyright laws may protect this digital image. Commercial use or distribution of the image is not permitted without prior permission of the copyright holder. For information see:  http://www.lib.uiowa.edu/spec-coll/help/copyright.html","John P. Vander Maas Railroadiana|John P. Vander Maas Railroadiana Collection|MSC0468|http://lib.uiowa.edu/collguides/?MSC0468|Vol. 40, Depots by county",8|11,,"Still image|Photographs|jpeg",40greene01.jpg|169946290|https://digital.lib.uiowa.edu/,,,,,,,,,,,,,,,,,,,,,,,,,,,,,,,,,,,,,,,,,,,,,,,,"<a href=""https://digital.lib.uiowa.edu/"" target=""_blank"">View this item in its source respository</a>",,,,,,,,,,,,,,,,,,,,,,,,,,,,,http://www.iowaheritage.org/files/original/0d56545e56cf11b174ed084271520dd1.jpg,"Remote Item","John P. Vander Maas Railroadiana",1,0
12635,http://www.iowaheritage.org/items/show/12635,"Kesley, Iowa. CNW","Railroad stations|Chicago and North Western Railway Company|United States -- Iowa -- Butler County -- Kesley|1950-1960|Buildings","Single story wooden depot.",unknown,,"University of Iowa. Libraries. Special Collections Dept.",1959-05-10|2005-09-13,,"Educational use only, no other permissions given. U.S. and international copyright laws may protect this digital image. Commercial use or distribution of the image is not permitted without prior permission of the copyright holder. For information see:  http://www.lib.uiowa.edu/spec-coll/help/copyright.html","John P. Vander Maas Railroadiana|John P. Vander Maas Railroadiana Collection|MSC0468|http://lib.uiowa.edu/collguides/?MSC0468|Vol. 40, Depots by county",8|11,,"Still image|Photographs|jpeg",40kesley01.jpg|169946290|https://digital.lib.uiowa.edu/,,,,,,,,,,,,,,,,,,,,,,,,,,,,,,,,,,,,,,,,,,,,,,,,"<a href=""https://digital.lib.uiowa.edu/"" target=""_blank"">View this item in its source respository</a>",,,,,,,,,,,,,,,,,,,,,,,,,,,,,http://www.iowaheritage.org/files/original/2b0d08a41232da7bf87aa2345295c260.jpg,"Remote Item","John P. Vander Maas Railroadiana",1,0
