 




﻿"Item Id","Item URI","Dublin Core:Title","Dublin Core:Subject","Dublin Core:Description","Dublin Core:Creator","Dublin Core:Source","Dublin Core:Publisher","Dublin Core:Date","Dublin Core:Contributor","Dublin Core:Rights","Dublin Core:Relation","Dublin Core:Format","Dublin Core:Language","Dublin Core:Type","Dublin Core:Identifier","Dublin Core:Coverage","Item Type Metadata:Text","Item Type Metadata:Interviewer","Item Type Metadata:Interviewee","Item Type Metadata:Location","Item Type Metadata:Transcription","Item Type Metadata:Local URL","Item Type Metadata:Original Format","Item Type Metadata:Physical Dimensions","Item Type Metadata:Duration","Item Type Metadata:Compression","Item Type Metadata:Producer","Item Type Metadata:Director","Item Type Metadata:Bit Rate/Frequency","Item Type Metadata:Time Summary","Item Type Metadata:Email Body","Item Type Metadata:Subject Line","Item Type Metadata:From","Item Type Metadata:To","Item Type Metadata:CC","Item Type Metadata:BCC","Item Type Metadata:Number of Attachments","Item Type Metadata:Standards","Item Type Metadata:Objectives","Item Type Metadata:Materials","Item Type Metadata:Lesson Plan Text","Item Type Metadata:URL","Item Type Metadata:Event Type","Item Type Metadata:Participants","Item Type Metadata:Birth Date","Item Type Metadata:Birthplace","Item Type Metadata:Death Date","Item Type Metadata:Occupation","Item Type Metadata:Biographical Text","Item Type Metadata:Bibliography","Item Type Metadata:Digital Reproduction Information","Item Type Metadata:Repository","Item Type Metadata:Repository Collection","Item Type Metadata:Contact information.","Item Type Metadata:File Name","Item Type Metadata:Notes","Item Type Metadata:Digital item created","Item Type Metadata:Digital item modified","Item Type Metadata:Executive Orders","Item Type Metadata:Record Created","Item Type Metadata:Record Modified","Item Type Metadata:Transcription2","Item Type Metadata:Source URL","Omeka Legacy File:Additional Creator","Omeka Legacy File:Transcriber","Omeka Legacy File:Producer","Omeka Legacy File:Render Device","Omeka Legacy File:Render Details","Omeka Legacy File:Capture Date","Omeka Legacy File:Capture Device","Omeka Legacy File:Capture Details","Omeka Legacy File:Change History","Omeka Legacy File:Watermark","Omeka Legacy File:Encryption","Omeka Legacy File:Compression","Omeka Legacy File:Post Processing","Omeka Image File:Width","Omeka Image File:Height","Omeka Image File:Bit Depth","Omeka Image File:Channels","Omeka Image File:Exif String","Omeka Image File:Exif Array","Omeka Image File:IPTC String","Omeka Image File:IPTC Array","Omeka Video File:Bitrate","Omeka Video File:Duration","Omeka Video File:Sample Rate","Omeka Video File:Codec","Omeka Video File:Width","Omeka Video File:Height",tags,file,itemType,collection,public,featured
15171,http://www.iowaheritage.org/items/show/15171,"East Des Moines, Iowa. CGW","Railroad stations|Chicago Great Western Railroad Company|United States -- Iowa -- Polk County -- East Des Moines|1960-1970|Railroad cars","Train on tracks. Building with sign for Oliver Corporation. ""STPKCSL. CGW Jct., IA. View looks NE on CGW R.O.W. CNW #1024 is headed SE on R.I. trackage with a transfer run from Hull Ave Yd to RI Short Line Yard. Ron Sims photo, 2717 Cornell, DM IA 50313""--Photograph verso.","Sims, Ronald D.",,"University of Iowa. Libraries. Special Collections Dept.",1967-10-21|2006-07-17,,"Educational use only, no other permissions given. U.S. and international copyright laws may protect this digital image. Commercial use or distribution of the image is not permitted without prior permission of the copyright holder. For information see:  http://www.lib.uiowa.edu/spec-coll/help/copyright.html","John P. Vander Maas Railroadiana|John P. Vander Maas Railroadiana Collection|MSC0468|http://lib.uiowa.edu/collguides/?MSC0468|Vol. 45, Depots by county",9|13,,"Still image|Photographs|jpeg",45eastdesmoines05.jpg|169946290|https://digital.lib.uiowa.edu/,,,,,,,,,,,,,,,,,,,,,,,,,,,,,,,,,,,,,,,,,,,,,,,,"<a href=""https://digital.lib.uiowa.edu/"" target=""_blank"">View this item in its source respository</a>",,,,,,,,,,,,,,,,,,,,,,,,,,,,,http://www.iowaheritage.org/files/original/1983da365f7bc2ec7d0fc88986c71b1c.jpg,"Remote Item","John P. Vander Maas Railroadiana",1,0
15174,http://www.iowaheritage.org/items/show/15174,"East Des Moines, Iowa. DMU","Railroad stations|Des Moines Union Railway Company|United States -- Iowa -- Polk County -- East Des Moines|1980-1990|Railroad cars","tracks intersecting. Train on tracks in distance. ""[] looks W. on N.S. (Norfolk Southern). [Ron] Sims photo, [2717] Cornell, [DM] IA 50313""--Photograph verso.","Sims, Ronald D.",,"University of Iowa. Libraries. Special Collections Dept.",1988-10-24|2006-07-17,,"Educational use only, no other permissions given. U.S. and international copyright laws may protect this digital image. Commercial use or distribution of the image is not permitted without prior permission of the copyright holder. For information see:  http://www.lib.uiowa.edu/spec-coll/help/copyright.html","John P. Vander Maas Railroadiana|John P. Vander Maas Railroadiana Collection|MSC0468|http://lib.uiowa.edu/collguides/?MSC0468|Vol. 45, Depots by county",8|12,,"Still image|Photographs|jpeg",45eastdesmoines06.jpg|169946290|https://digital.lib.uiowa.edu/,,,,,,,,,,,,,,,,,,,,,,,,,,,,,,,,,,,,,,,,,,,,,,,,"<a href=""https://digital.lib.uiowa.edu/"" target=""_blank"">View this item in its source respository</a>",,,,,,,,,,,,,,,,,,,,,,,,,,,,,http://www.iowaheritage.org/files/original/b7b10090865ad61fcb1809c59c5deced.jpg,"Remote Item","John P. Vander Maas Railroadiana",1,0
12683,http://www.iowaheritage.org/items/show/12683,"Rockwell City, IA. IC","Railroad stations|Illinois Central Railroad Company|United States -- Iowa -- Calhoun County -- Rockwell City|Buildings|Grain elevators|Railroad cars","Single story depot with two garage doors.  Grain elevator and train on tracks behind. ""Neg. from R. B. Trible""--Photograph verso.","Trible, R.B.",,"University of Iowa. Libraries. Special Collections Dept.",Unknown|2005-09-15,,"Educational use only, no other permissions given. U.S. and international copyright laws may protect this digital image. Commercial use or distribution of the image is not permitted without prior permission of the copyright holder. For information see:  http://www.lib.uiowa.edu/spec-coll/help/copyright.html","John P. Vander Maas Railroadiana|John P. Vander Maas Railroadiana Collection|MSC0468|http://lib.uiowa.edu/collguides/?MSC0468|Vol. 41, Depots by county",7|12,,"Still image|Photographs|jpeg",41rockwellcity03.jpg|169946290|https://digital.lib.uiowa.edu/,,,,,,,,,,,,,,,,,,,,,,,,,,,,,,,,,,,,,,,,,,,,,,,,"<a href=""https://digital.lib.uiowa.edu/"" target=""_blank"">View this item in its source respository</a>",,,,,,,,,,,,,,,,,,,,,,,,,,,,,http://www.iowaheritage.org/files/original/4e00343f6ada5db7a52c585b3d00ceff.jpg,"Remote Item","John P. Vander Maas Railroadiana",1,0
10390,http://www.iowaheritage.org/items/show/10390,"Capitol City Brick and Pipe Company, Des Moines, Iowa, late 1890s or early 1900s","Geology|Capitol City Brick and Pipe Company (Iowa)|United States -- Iowa -- Polk County -- Des Moines|190-|Brick industry|Pipe industry|Railroad cars|Buildings",,unknown,"Photographs scanned using Epson Expression 1680 scanner at 300 ppi, 8-bit greyscale.","University of Iowa. Dept. of Geoscience. Paleontology Repository|Contact Tiffany Adrain (tiffany-adrain@uiowa.edu) at The University of Iowa Paleontology Repository http://www.uiowa.edu/~geology/paleo",1895/1910|2006-03-09,,"This digital image may be used for educational purposes, as long as it is not altered in any way. No commercial reproduction or distribution of this file is permitted without permission.","Calvin Geological Photographs|This digital collection contains the geology-related images originally digitized for the Dept. of Geosciences' Calvin web exhibit: http://www.uiowa.edu/~calvin/calvin.htm . Calvin's images of Iowa City can be viewed in the Iowa City Town and Campus Scenes Digital Collection: http://digital.lib.uiowa.edu/ictcs",jpeg|5|7,,"Still image|Photographs",1129|173611416|https://digital.lib.uiowa.edu/,,,,,,,,,,,,,,,,,,,,,,,,,,,,,,,,,,,,,,,,,,,,,,,,"<a href=""https://digital.lib.uiowa.edu/"" target=""_blank"">View this item in its source respository</a>",,,,,,,,,,,,,,,,,,,,,,,,,,,,,http://www.iowaheritage.org/files/original/f39dddfd87e6cecbefb489319705bb01.jpg,"Remote Item","African American Women in Iowa Collection",1,0
10535,http://www.iowaheritage.org/items/show/10535,"Railroad cars at Iowa Ballast Construction Co., Maxon, Iowa, late 1890s or early 1900s","Geology|Iowa Ballast and Construction Co. (Maxon, Iowa)|United States -- Iowa -- Monroe County -- Maxon|190-|Railroad cars",,unknown,"Photographs scanned using Epson Expression 1680 scanner at 300 ppi, 8-bit greyscale.","University of Iowa. Dept. of Geoscience. Paleontology Repository|Contact Tiffany Adrain (tiffany-adrain@uiowa.edu) at The University of Iowa Paleontology Repository http://www.uiowa.edu/~geology/paleo",1895/1910|2006-03-09,,"This digital image may be used for educational purposes, as long as it is not altered in any way. No commercial reproduction or distribution of this file is permitted without permission.","Calvin Geological Photographs|This digital collection contains the geology-related images originally digitized for the Dept. of Geosciences' Calvin web exhibit: http://www.uiowa.edu/~calvin/calvin.htm . Calvin's images of Iowa City can be viewed in the Iowa City Town and Campus Scenes Digital Collection: http://digital.lib.uiowa.edu/ictcs",jpeg|5|7,,"Still image|Photographs",1178|173611416|https://digital.lib.uiowa.edu/,,,,,,,,,,,,,,,,,,,,,,,,,,,,,,,,,,,,,,,,,,,,,,,,"<a href=""https://digital.lib.uiowa.edu/"" target=""_blank"">View this item in its source respository</a>",,,,,,,,,,,,,,,,,,,,,,,,,,,,,http://www.iowaheritage.org/files/original/dcb734a7cc677c45e6ad6b0af881d4af.jpg,"Remote Item","African American Women in Iowa Collection",1,0
10543,http://www.iowaheritage.org/items/show/10543,"Men on railroad cars near Iowa Ballast and Construction Co., Maxon, Iowa, late 1890s or early 1900s","Geology|Iowa Ballast and Construction Co. (Maxon, Iowa)|United States -- Iowa -- Monroe County -- Maxon|190-|People|Railroad cars",,unknown,"Photographs scanned using Epson Expression 1680 scanner at 300 ppi, 8-bit greyscale.","University of Iowa. Dept. of Geoscience. Paleontology Repository|Contact Tiffany Adrain (tiffany-adrain@uiowa.edu) at The University of Iowa Paleontology Repository http://www.uiowa.edu/~geology/paleo",1895/1910|2006-03-09,,"This digital image may be used for educational purposes, as long as it is not altered in any way. No commercial reproduction or distribution of this file is permitted without permission.","Calvin Geological Photographs|This digital collection contains the geology-related images originally digitized for the Dept. of Geosciences' Calvin web exhibit: http://www.uiowa.edu/~calvin/calvin.htm . Calvin's images of Iowa City can be viewed in the Iowa City Town and Campus Scenes Digital Collection: http://digital.lib.uiowa.edu/ictcs",jpeg|5|7,,"Still image|Photographs",1192|173611416|https://digital.lib.uiowa.edu/,,,,,,,,,,,,,,,,,,,,,,,,,,,,,,,,,,,,,,,,,,,,,,,,"<a href=""https://digital.lib.uiowa.edu/"" target=""_blank"">View this item in its source respository</a>",,,,,,,,,,,,,,,,,,,,,,,,,,,,,http://www.iowaheritage.org/files/original/3cc85292d18d79533c8c20691c31b016.jpg,"Remote Item","African American Women in Iowa Collection",1,0
10597,http://www.iowaheritage.org/items/show/10597,"Mine at Mt. Iron, Minn., late 1890s or early 1900s","Geology|United States -- Minnesota -- St. Louis County -- Mountain Iron|190-|Mining|Railroad tracks|Railroad cars",,unknown,"Photographs scanned using Epson Expression 1680 scanner at 300 ppi, 8-bit greyscale.","University of Iowa. Dept. of Geoscience. Paleontology Repository|Contact Tiffany Adrain (tiffany-adrain@uiowa.edu) at The University of Iowa Paleontology Repository http://www.uiowa.edu/~geology/paleo",1895/1910|2006-03-23,,"This digital image may be used for educational purposes, as long as it is not altered in any way. No commercial reproduction or distribution of this file is permitted without permission.","Calvin Geological Photographs|This digital collection contains the geology-related images originally digitized for the Dept. of Geosciences' Calvin web exhibit: http://www.uiowa.edu/~calvin/calvin.htm . Calvin's images of Iowa City can be viewed in the Iowa City Town and Campus Scenes Digital Collection: http://digital.lib.uiowa.edu/ictcs",jpeg|5|7,,"Still image|Photographs; Dry collodion negatives",2173|2732|173611416|https://digital.lib.uiowa.edu/,,,,,,,,,,,,,,,,,,,,,,,,,,,,,,,,,,,,,,,,,,,,,,,,"<a href=""https://digital.lib.uiowa.edu/"" target=""_blank"">View this item in its source respository</a>",,,,,,,,,,,,,,,,,,,,,,,,,,,,,http://www.iowaheritage.org/files/original/be355fa6b4886872286fb5a9950ba24a.jpg,"Remote Item","African American Women in Iowa Collection",1,0
10680,http://www.iowaheritage.org/items/show/10680,"Railroad flat cars in J. C. Gravel Pit, Independence, Iowa, late 1890s or early 1900s","Geology|J.C. Gravel Pit (Independence, Iowa)|United States -- Iowa -- Buchanan County -- Independence|190-|Cenozoic -- Pleistocene|Buchanan Gravels|Holes|Railroad cars",,unknown,"Photographs scanned using Epson Expression 1680 scanner at 300 ppi, 8-bit greyscale.","University of Iowa. Dept. of Geoscience. Paleontology Repository|Contact Tiffany Adrain (tiffany-adrain@uiowa.edu) at The University of Iowa Paleontology Repository http://www.uiowa.edu/~geology/paleo",1895/1910|2006-03-02,,"This digital image may be used for educational purposes, as long as it is not altered in any way. No commercial reproduction or distribution of this file is permitted without permission.","Calvin Geological Photographs|This digital collection contains the geology-related images originally digitized for the Dept. of Geosciences' Calvin web exhibit: http://www.uiowa.edu/~calvin/calvin.htm . Calvin's images of Iowa City can be viewed in the Iowa City Town and Campus Scenes Digital Collection: http://digital.lib.uiowa.edu/ictcs|View related article: http://cdm.lib.uiowa.edu/u?/digs,5690",jpeg|5|7,,"Still image|Photographs; Dry collodion negatives",0860|1326|173611416|https://digital.lib.uiowa.edu/,,,,,,,,,,,,,,,,,,,,,,,,,,,,,,,,,,,,,,,,,,,,,,,,"<a href=""https://digital.lib.uiowa.edu/"" target=""_blank"">View this item in its source respository</a>",,,,,,,,,,,,,,,,,,,,,,,,,,,,,http://www.iowaheritage.org/files/original/0b7b8d4cbc859f22733509a206661bed.jpg,"Remote Item","African American Women in Iowa Collection",1,0
12285,http://www.iowaheritage.org/items/show/12285,"Nodaway, Iowa. CBQ","Railroad stations|Chicago, Burlington & Quincy Railroad Company|United States -- Iowa -- Iowa County -- Nodaway|1960-1970|Buildings|Railroad cars|","Small wooden depot with two railroad cars parked on the tracks next to it.  In the background there is a barn.",unknown,,"University of Iowa. Libraries. Special Collections Dept.",1964-09-21|2005-03-21,,"Educational use only, no other permissions given. U.S. and international copyright laws may protect this digital image. Commercial use or distribution of the image is not permitted without prior permission of the copyright holder. For information see:  http://www.lib.uiowa.edu/spec-coll/help/copyright.html","John P. Vander Maas Railroadiana|John P. Vander Maas Railroadiana Collection|MSC0468|http://lib.uiowa.edu/collguides/?MSC0468|vol. 40, Depots by County",8|12,,"Still image|Photographs|jpeg",40nodaway01.jpg|169946290|https://digital.lib.uiowa.edu/,,,,,,,,,,,,,,,,,,,,,,,,,,,,,,,,,,,,,,,,,,,,,,,,"<a href=""https://digital.lib.uiowa.edu/"" target=""_blank"">View this item in its source respository</a>",,,,,,,,,,,,,,,,,,,,,,,,,,,,,http://www.iowaheritage.org/files/original/80ee96c219252c2c7dc43f72094f6628.jpg,"Remote Item","John P. Vander Maas Railroadiana",1,0
12291,http://www.iowaheritage.org/items/show/12291,"Lansing, Iowa. MILW","Railroad stations|Chicago, Rock Island & Pacific Rail Road Co.|United States -- Iowa -- Allamakee County -- Lansing|1950-1960|Buildings|Railroad cars|Automobiles|Railroad signals","Small wooden depot with two garage doors on a  loading dock.  A truck is backed up to a railroad car.   There are a couple of railroad cars sitting on the tracks to the right of the depot.  A signal light towers above the depot from behind.",unknown,,"The University of Iowa Libraries Special Collections: http://www.lib.uiowa.edu/spec-coll/",1956-07-14|2005-03-23,,"Educational use only, no other permissions given. U.S. and international copyright laws may protect this digital image. Commercial use or distribution of the image is not permitted without prior permission of the copyright holder. For information see:  http://www.lib.uiowa.edu/spec-coll/help/copyright.html","John P. Vander Maas Railroadiana|John P. Vander Maas Railroadiana Collection|MSC0468|http://lib.uiowa.edu/collguides/?MSC0468|Vol. 40, Depots by county",8|12,,"Still image|Photographs|jpeg",40lansing01.jpg|169946290|https://digital.lib.uiowa.edu/,,,,,,,,,,,,,,,,,,,,,,,,,,,,,,,,,,,,,,,,,,,,,,,,"<a href=""https://digital.lib.uiowa.edu/"" target=""_blank"">View this item in its source respository</a>",,,,,,,,,,,,,,,,,,,,,,,,,,,,,http://www.iowaheritage.org/files/original/df14b030970541e5c54ac366e063059c.jpg,"Remote Item","John P. Vander Maas Railroadiana",1,0
