 




﻿"Item Id","Item URI","Dublin Core:Title","Dublin Core:Subject","Dublin Core:Description","Dublin Core:Creator","Dublin Core:Source","Dublin Core:Publisher","Dublin Core:Date","Dublin Core:Contributor","Dublin Core:Rights","Dublin Core:Relation","Dublin Core:Format","Dublin Core:Language","Dublin Core:Type","Dublin Core:Identifier","Dublin Core:Coverage","Item Type Metadata:Text","Item Type Metadata:Interviewer","Item Type Metadata:Interviewee","Item Type Metadata:Location","Item Type Metadata:Transcription","Item Type Metadata:Local URL","Item Type Metadata:Original Format","Item Type Metadata:Physical Dimensions","Item Type Metadata:Duration","Item Type Metadata:Compression","Item Type Metadata:Producer","Item Type Metadata:Director","Item Type Metadata:Bit Rate/Frequency","Item Type Metadata:Time Summary","Item Type Metadata:Email Body","Item Type Metadata:Subject Line","Item Type Metadata:From","Item Type Metadata:To","Item Type Metadata:CC","Item Type Metadata:BCC","Item Type Metadata:Number of Attachments","Item Type Metadata:Standards","Item Type Metadata:Objectives","Item Type Metadata:Materials","Item Type Metadata:Lesson Plan Text","Item Type Metadata:URL","Item Type Metadata:Event Type","Item Type Metadata:Participants","Item Type Metadata:Birth Date","Item Type Metadata:Birthplace","Item Type Metadata:Death Date","Item Type Metadata:Occupation","Item Type Metadata:Biographical Text","Item Type Metadata:Bibliography","Item Type Metadata:Digital Reproduction Information","Item Type Metadata:Repository","Item Type Metadata:Repository Collection","Item Type Metadata:Contact information.","Item Type Metadata:File Name","Item Type Metadata:Notes","Item Type Metadata:Digital item created","Item Type Metadata:Digital item modified","Item Type Metadata:Executive Orders","Item Type Metadata:Record Created","Item Type Metadata:Record Modified","Item Type Metadata:Transcription2","Item Type Metadata:Source URL","Omeka Legacy File:Additional Creator","Omeka Legacy File:Transcriber","Omeka Legacy File:Producer","Omeka Legacy File:Render Device","Omeka Legacy File:Render Details","Omeka Legacy File:Capture Date","Omeka Legacy File:Capture Device","Omeka Legacy File:Capture Details","Omeka Legacy File:Change History","Omeka Legacy File:Watermark","Omeka Legacy File:Encryption","Omeka Legacy File:Compression","Omeka Legacy File:Post Processing","Omeka Image File:Width","Omeka Image File:Height","Omeka Image File:Bit Depth","Omeka Image File:Channels","Omeka Image File:Exif String","Omeka Image File:Exif Array","Omeka Image File:IPTC String","Omeka Image File:IPTC Array","Omeka Video File:Bitrate","Omeka Video File:Duration","Omeka Video File:Sample Rate","Omeka Video File:Codec","Omeka Video File:Width","Omeka Video File:Height",tags,file,itemType,collection,public,featured
64413,http://www.iowaheritage.org/items/show/64413,"Bond funds","Governors|Branstad, Terry E.|Iowa|Governors|1990-2000|Legislators|Legislature|Credit|State governments|State governments -- Officials and employees|States|Budgets|Bonds|Deficits|Men|Clothes, Tattered|Machines","Instant cash; It ate our card!; Legislature; Unacceptable credit risk","Duffy, Brian, 1955-",,"University of Iowa. Libraries. Special Collections Dept.",1991-01-13|2011-04,,"Educational use only, no other permissions given. Copyright to this digital object is owned by The Des Moines Register; it may not be downloaded, reproduced, or distributed without written permission. For more information, contact the Special Collections Department.","Editorial Cartoons of Brian Duffy; Des Moines Register Cartoonists|Papers of Brian Duffy|Des Moines Register",,English,"Still image|Editorial cartoons",MSC916|duffy-910113|http://digital.lib.uiowa.edu/cdm/ref/collection/duffy/id/251,,,,,,,,,,,,,,,,,,,,,,,,,,,,,,,,,,,,,,,,,,,,,,,,"<a href=""http://digital.lib.uiowa.edu/cdm/ref/collection/duffy/id/251"" target=""_blank"">View this item in its source respository</a>",,,,,,,,,,,,,,,,,,,,,,,,,,,,,http://www.iowaheritage.org/files/original/b81fdacf9147f95edc53f4421e606222.jpg,"Remote Item","Editorial Cartoons of Brian Duffy",1,0
64654,http://www.iowaheritage.org/items/show/64654,Bookends,"Government|Branstad, Terry E.|Iowa|Books|1990-2000|Governors|Legislature|Reform|State governments -- Officials and employees|Shelving|Cobwebs|Governors|Men|Sleeping|Spiders","State government reform study #2; County reform study #8; Iowa's future study #4; State government reform study #9; Iowa in the 21st century; Zzz; Legislature","Duffy, Brian, 1955-",,"University of Iowa. Libraries. Special Collections Dept.",1992-04-05|2011-04,,"Educational use only, no other permissions given. Copyright to this digital object is owned by The Des Moines Register; it may not be downloaded, reproduced, or distributed without written permission. For more information, contact the Special Collections Department.","Editorial Cartoons of Brian Duffy; Des Moines Register Cartoonists|Papers of Brian Duffy|Des Moines Register",,English,"Still image|Editorial cartoons",MSC916|duffy-920405|http://digital.lib.uiowa.edu/cdm/ref/collection/duffy/id/492,,,,,,,,,,,,,,,,,,,,,,,,,,,,,,,,,,,,,,,,,,,,,,,,"<a href=""http://digital.lib.uiowa.edu/cdm/ref/collection/duffy/id/492"" target=""_blank"">View this item in its source respository</a>",,,,,,,,,,,,,,,,,,,,,,,,,,,,,http://www.iowaheritage.org/files/original/6806ece55528212ab5a1b07b241a936b.jpg,"Remote Item","Editorial Cartoons of Brian Duffy",1,0
41228,http://www.iowaheritage.org/items/show/41228,"Boone County plat book and farm directory, ca.1935","United States|Iowa|Boone County|1930-1940",,,,"Merchants' Messenger|University of Iowa. Libraries. Map Collection",1935|2007-10-29,,"Educational use only, no other permissions given.  U.S. and international copyright laws may protect this digital object.  Commercial use or distribution of the object is not permitted without prior permission of the copyright holder.","Iowa Counties Historic Atlases","1 atlas : 59 l. ; 21 X 28 cm.",eng,"Still image; Text|Advertisements; Directories; Maps",168474626|https://digital.lib.uiowa.edu/,,,,,,,,,,,,,,,,,,,,,,,,,,,,,,,,,,,,,,,,,,,,,,,,"<a href=""https://digital.lib.uiowa.edu/"" target=""_blank"">View this item in its source respository</a>",,,,,,,,,,,,,,,,,,,,,,,,,,,,,http://www.iowaheritage.org/files/original/6d45a4933a9392e6e46d4362cf2da13f.jpg,"Remote Item","Iowa Counties Historic Atlases",1,0
64275,http://www.iowaheritage.org/items/show/64275,Bop,"Campaigning|Kerry, John, 1943-|Iowa|Rabbits|2000-2010|Campaigns|Democrats|Candidates|Primaries|Caucus|Nominations for office|Presidency|Dean, Howard, 1948-|Gephardt, Richard A. (Richard Andrew), 1941-|Edwards, John, 1953 June 10-|Men|Candidates|Turtles|Trees|Staffs (Sticks)|Fighting|Senators|Governors","Kerry; Dean; Gephardt; Edwards","Duffy, Brian, 1955-",,"University of Iowa. Libraries. Special Collections Dept.",2004-01-07|2011-04,,"Educational use only, no other permissions given. Copyright to this digital object is owned by The Des Moines Register; it may not be downloaded, reproduced, or distributed without written permission. For more information, contact the Special Collections Department.","Editorial Cartoons of Brian Duffy; Des Moines Register Cartoonists|Papers of Brian Duffy|Des Moines Register",,English,"Still image|Editorial cartoons",MSC916|duffy-040107|http://digital.lib.uiowa.edu/cdm/ref/collection/duffy/id/113,,,,,,,,,,,,,,,,,,,,,,,,,,,,,,,,,,,,,,,,,,,,,,,,"<a href=""http://digital.lib.uiowa.edu/cdm/ref/collection/duffy/id/113"" target=""_blank"">View this item in its source respository</a>",,,,,,,,,,,,,,,,,,,,,,,,,,,,,http://www.iowaheritage.org/files/original/31c47d28682df4abb3ce01a50c5642f1.jpg,"Remote Item","Editorial Cartoons of Brian Duffy",1,0
78932,http://www.iowaheritage.org/items/show/78932,"Boys Track Event at the Oskaloosa, Iowa Community Stadium in 1926","Track|Boys|Community Stadium|Oskaloosa|Iowa|Mahaska County|Early 20th Century","Pictured here are boys participating in a track event at the Oskaloosa Community Stadium in 1926.  The ground for the stadium was originally broke in 1925, and the stadium was completely finished in 1929, although meets like this were able to be conducted there even in 1926.  The stadium served and continues to serve today the football and track teams of Oskaloosa High School and William Penn University.","Chuck Russell","Chuck Russell","Chuck Russell","""2009-06-05""",,www.wmpenn.edu/library/about.html,,"still image/jpeg 2000",,image,"www.wmpenn.edu/library/about.html|http://cdm16125.contentdm.oclc.org/u?/p270701coll6,211",,,,,,,,,,,,,,,,,,,,,,,,,,,,,,,,,,,,,,,,,,,,,,,,"<a href=""http://cdm16125.contentdm.oclc.org/u?/p270701coll6,211"" target=""_blank"">View this item in its source respository</a>",,,,,,,,,,,,,,,,,,,,,,,,,,,,,http://www.iowaheritage.org/files/original/cfb47c4a0b5b03bf3e00074c696d7aea.jpg,"Remote Item","Mahaska History",1,0
78409,http://www.iowaheritage.org/items/show/78409,"Breaking Sod for the New Friends Yearly Meeting House Attendees, circa 1912, Oskaloosa, Iowa; Mahaska County","Church|Friends|Meeting House|Quakers|20th Century|Religion|Oskaloosa|Iowa|Mahaska County","Religion has always played a very important role in Mahaska County, Iowa.  One of the credits to the county has been its people's tolerance for others to worship freely without fear.  This is a roster of the Quakers/Friends responsible for breaking ground for a new Yearly Meeting House in 1912.","Mahaska County Historical Society","Historical Archives","Mahaska County Historical Society",1912|2008-08-04,,www.nelsonpioneer.org,,"still image/jpeg",,image,"Mahaska County Historical Society|http://cdm16125.contentdm.oclc.org/u?/p270701coll7,69",,,,,,,,,,,,,,,,,,,,,,,,,,,,,,,,,,,,,,,,,,,,,,,,"<a href=""http://cdm16125.contentdm.oclc.org/u?/p270701coll7,69"" target=""_blank"">View this item in its source respository</a>",,,,,,,,,,,,,,,,,,,,,,,,,,,,,http://www.iowaheritage.org/files/original/035621c3151da53231ebf5835dc8a1cd.jpg,"Remote Item","Mahaska County Historical Society",1,0
78408,http://www.iowaheritage.org/items/show/78408,"Breaking Sod for the New Friends Yearly Meeting House, circa 1912, Oskaloosa, Iowa; Mahaska County","Church|Friends|Meeting House|Quakers|20th Century|Religion|Oskaloosa|Iowa|Mahaska County","Religion has always played a very important role in Mahaska County, Iowa.  One of the credits to the county has been its people's tolerance for others to worship freely without fear.  This is a picture of Quakers/Friends breaking ground for a new Yearly Meeting House in 1912.","Mahaska County Historical Society","Historical Archives","Mahaska County Historical Society",1912|2008-08-04,,www.nelsonpioneer.org,,"still image/jpeg",,image,"Mahaska County Historical Society|http://cdm16125.contentdm.oclc.org/u?/p270701coll7,68",,,,,,,,,,,,,,,,,,,,,,,,,,,,,,,,,,,,,,,,,,,,,,,,"<a href=""http://cdm16125.contentdm.oclc.org/u?/p270701coll7,68"" target=""_blank"">View this item in its source respository</a>",,,,,,,,,,,,,,,,,,,,,,,,,,,,,http://www.iowaheritage.org/files/original/adbfd61b82fe03d27d383a264d561fbe.jpg,"Remote Item","Mahaska County Historical Society",1,0
78410,http://www.iowaheritage.org/items/show/78410,"Breaking Sod for the New Friends Yearly Meeting House, circa 1912, Oskaloosa, Iowa; Mahaska County","Church|Friends|Meeting House|Quakers|20th Century|Religion|Oskaloosa|Iowa|Mahaska County","Religion has always played a very important role in Mahaska County, Iowa.  One of the credits to the county has been its people's tolerance for others to worship freely without fear.  This is a picture of of Quakers/Friends breaking ground for a new Yearly Meeting House in 1912.","Mahaska County Historical Society","Historical Archives","Mahaska County Historical Society",1912|2008-08-04,,www.nelsonpioneer.org,,"still image/jpeg",,image,"Mahaska County Historical Society|http://cdm16125.contentdm.oclc.org/u?/p270701coll7,70",,,,,,,,,,,,,,,,,,,,,,,,,,,,,,,,,,,,,,,,,,,,,,,,"<a href=""http://cdm16125.contentdm.oclc.org/u?/p270701coll7,70"" target=""_blank"">View this item in its source respository</a>",,,,,,,,,,,,,,,,,,,,,,,,,,,,,http://www.iowaheritage.org/files/original/d6da49bf42754e2fc26b0927dd1822cc.jpg,"Remote Item","Mahaska County Historical Society",1,0
78551,http://www.iowaheritage.org/items/show/78551,"Bridge over the Skunk River in 1896; Iowa; Mahaska County","Bridges|Rivers|United States|Midwest|Iowa|Mahaska County|Keokuk County|Mississippi River|tributaries|Nature","Bridge going over the Skunk River in 1896.  The Skunk River is a mid-size river in terms of both its width and distance.  The Skunk River also consists of two branches: the North Skunk River and South Skunk River.  The irony of the two branches is that the South Skunk River actually begins its descent to the Mississippi River north of the North Skunk River.  The two branches come together in Keokuk County, which borders Mahaska County directly to the East.","H. Kirk Watkins","Mahaska County Collection","The Times Company",2008-06-20,,www.wmpenn.edu/library/library/about.html,,"still image/jpeg",,image,"Wilcox Library|http://cdm16125.contentdm.oclc.org/u?/p270701coll6,11",,,,,,,,,,,,,,,,,,,,,,,,,,,,,,,,,,,,,,,,,,,,,,,,"<a href=""http://cdm16125.contentdm.oclc.org/u?/p270701coll6,11"" target=""_blank"">View this item in its source respository</a>",,,,,,,,,,,,,,,,,,,,,,,,,,,,,http://www.iowaheritage.org/files/original/0b7d1ec25ecea1b5093a9e5624aecd5d.jpg,"Remote Item","Mahaska History",1,0
64542,http://www.iowaheritage.org/items/show/64542,"Buckle up!","Legislation|Iowa|Automobiles|1980-1990|Legislature|Driving|Driving safety|Drivers|Speeding|Traffic accidents|Traffic laws|Traffic regulations|Death|Automobile drivers|Death|Helmets|Tickets|Roads|Feet|Racing automobiles","Lead; Traffic fatalities; I can't drive 55; Legislature; Speeding ticket","Duffy, Brian, 1955-",,"University of Iowa. Libraries. Special Collections Dept.",1985-03-12|2011-04,,"Educational use only, no other permissions given. Copyright to this digital object is owned by The Des Moines Register; it may not be downloaded, reproduced, or distributed without written permission. For more information, contact the Special Collections Department.","Editorial Cartoons of Brian Duffy; Des Moines Register Cartoonists|Papers of Brian Duffy|Des Moines Register",,English,"Still image|Editorial cartoons",MSC916|duffy-850312|http://digital.lib.uiowa.edu/cdm/ref/collection/duffy/id/380,,,,,,,,,,,,,,,,,,,,,,,,,,,,,,,,,,,,,,,,,,,,,,,,"<a href=""http://digital.lib.uiowa.edu/cdm/ref/collection/duffy/id/380"" target=""_blank"">View this item in its source respository</a>",,,,,,,,,,,,,,,,,,,,,,,,,,,,,http://www.iowaheritage.org/files/original/99677b25d4cca4d272de24c293cfa572.jpg,"Remote Item","Editorial Cartoons of Brian Duffy",1,0
