 




﻿"Item Id","Item URI","Dublin Core:Title","Dublin Core:Subject","Dublin Core:Description","Dublin Core:Creator","Dublin Core:Source","Dublin Core:Publisher","Dublin Core:Date","Dublin Core:Contributor","Dublin Core:Rights","Dublin Core:Relation","Dublin Core:Format","Dublin Core:Language","Dublin Core:Type","Dublin Core:Identifier","Dublin Core:Coverage","Item Type Metadata:Text","Item Type Metadata:Interviewer","Item Type Metadata:Interviewee","Item Type Metadata:Location","Item Type Metadata:Transcription","Item Type Metadata:Local URL","Item Type Metadata:Original Format","Item Type Metadata:Physical Dimensions","Item Type Metadata:Duration","Item Type Metadata:Compression","Item Type Metadata:Producer","Item Type Metadata:Director","Item Type Metadata:Bit Rate/Frequency","Item Type Metadata:Time Summary","Item Type Metadata:Email Body","Item Type Metadata:Subject Line","Item Type Metadata:From","Item Type Metadata:To","Item Type Metadata:CC","Item Type Metadata:BCC","Item Type Metadata:Number of Attachments","Item Type Metadata:Standards","Item Type Metadata:Objectives","Item Type Metadata:Materials","Item Type Metadata:Lesson Plan Text","Item Type Metadata:URL","Item Type Metadata:Event Type","Item Type Metadata:Participants","Item Type Metadata:Birth Date","Item Type Metadata:Birthplace","Item Type Metadata:Death Date","Item Type Metadata:Occupation","Item Type Metadata:Biographical Text","Item Type Metadata:Bibliography","Item Type Metadata:Digital Reproduction Information","Item Type Metadata:Repository","Item Type Metadata:Repository Collection","Item Type Metadata:Contact information.","Item Type Metadata:File Name","Item Type Metadata:Notes","Item Type Metadata:Digital item created","Item Type Metadata:Digital item modified","Item Type Metadata:Executive Orders","Item Type Metadata:Record Created","Item Type Metadata:Record Modified","Item Type Metadata:Transcription2","Item Type Metadata:Source URL","Omeka Legacy File:Additional Creator","Omeka Legacy File:Transcriber","Omeka Legacy File:Producer","Omeka Legacy File:Render Device","Omeka Legacy File:Render Details","Omeka Legacy File:Capture Date","Omeka Legacy File:Capture Device","Omeka Legacy File:Capture Details","Omeka Legacy File:Change History","Omeka Legacy File:Watermark","Omeka Legacy File:Encryption","Omeka Legacy File:Compression","Omeka Legacy File:Post Processing","Omeka Image File:Width","Omeka Image File:Height","Omeka Image File:Bit Depth","Omeka Image File:Channels","Omeka Image File:Exif String","Omeka Image File:Exif Array","Omeka Image File:IPTC String","Omeka Image File:IPTC Array","Omeka Video File:Bitrate","Omeka Video File:Duration","Omeka Video File:Sample Rate","Omeka Video File:Codec","Omeka Video File:Width","Omeka Video File:Height",tags,file,itemType,collection,public,featured
69382,http://www.iowaheritage.org/items/show/69382,"View of yellow houses and barn in Fall","Barn|Chauffeur's house|Gardener's house|United States -- Iowa -- Dubuque County","View looks West",unknown,,,"c. 1970-1974","John N. Gronen","This digital image may be used for educational purposes, as long as it is not altered in any way. No commercial reproduction or distribution of this file is permitted without permission. For permission to use the digital image, please contact: office@fourmounds.org",,"1 photograph : color; 8 x 10.5 cm; jpeg",,"still image; photograph",,,,,,,,,,,,,,,,,,,,,,,,,,,,,,,,,,,,,"Photographs scanned using HP Scanjet 3500c scanner at 600ppi, 24-bit depth.","Four Mounds Digital Collection",,,parc_623.jpg,,2007-02-20,,,,,,,,,,,,,,,,,,,,,,,,,,,,,,,,,,,http://www.iowaheritage.org/files/original/bc02fe29285cc61ef7051cf600ab9e2e.jpg,"Still Image","Four Mounds Digital Collection",1,0
69268,http://www.iowaheritage.org/items/show/69268,"John, Jr. on sidewalk to Gardner's house","Burden family|Gronen family|Gronen, Jr., John Nelson, 1964-|Gardener's house|United States -- Iowa -- Dubuque County","View looks North",unknown,,,"c. 1968-1972","John N. Gronen","This digital image may be used for educational purposes, as long as it is not altered in any way. No commercial reproduction or distribution of this file is permitted without permission. For permission to use the digital image, please contact: office@fourmounds.org",,"1 photograph : color ; 8 x 10 cm; jpeg",,"still image; photograph",,,,,,,,,,,,,,,,,,,,,,,,,,,,,,,,,,,,,"Photographs scanned using HP Scanjet 3500c scanner at 600ppi, 24-bit depth.","Four Mounds Digital Collection",,,parc_562.jpg,,2007-02-12,,,,,,,,,,,,,,,,,,,,,,,,,,,,,,,,,,,http://www.iowaheritage.org/files/original/0297e9566fc4a1bfa78a62ddc23c94c3.jpg,"Still Image","Four Mounds Digital Collection",1,0
50749,http://www.iowaheritage.org/items/show/50749,"Four Mounds National Register of Historic Places Nomination Form","Architecture|United States -- Iowa -- Dubuque County|Buildings--Designs and plans|Burden family|Barn|Cabin|Chauffeur's house|Gardener's house|Grey house|Hog shed|Ice house|Mounds|Playhouses|Porch Ramada|Pump house|Rock garden|Root cellar|White house|Woodshop",,,,,,"Four Mounds Foundation","This digital image may be used for educational purposes, as long as it is not altered in any way. No commercial reproduction or distribution of this file is permitted without permission. For permission to use the digital image, please contact: office@fourmounds.org",,"1 document : 33 p. ; 11 in|PDF",,"Still Image; Documents",,,,,,,,,,,,,,,,,,,,,,,,,,,,,,,,,,,,,"Document scanned using Ricoh Aficio 3238 scanner at  ppi, 24-bit depth.",,"Four Mounds Digital Collection",,moundsNRHPR.pdf,"NPS Form 10-9M)-a   (8-86)   United States Department of the Interior   National Park Service   O M Approval No. 1024-0018   National Register of Historic Places   Continuation Sheet   Four Mounds Estate Historic District   Section number 7 Page I Dubuque",7/26/2006,,,,,,,,,,,,,,,,,,,,,,,,,,,,,,,,,,,http://www.iowaheritage.org/files/original/0681d54dc77c22f04b22be350e629b6f.jpg,"Still Image","Four Mounds Digital Collection",1,0
50738,http://www.iowaheritage.org/items/show/50738,"Farm campus from upper lane","Barn|United States -- Iowa -- Dubuque County|Chauffeur's house|Chicken house|Gardener's house|Hog shed","Photograph of farm campus from upper lane, looking west. Buildings from left right: Gardener's house, barn/garage, Chauffeur's house, Ice house (small portion), Chicken coop, hog shed (far right).",unknown,,,198-?,"Four Mounds Foundation","This digital image may be used for educational purposes, as long as it is not altered in any way. No commercial reproduction or distribution of this file is permitted without permission. For permission to use the digital image, please contact:  office@fourmounds.org",,"1 photograph : b&w ; 8 x 10 in|JPEG",,"Still Image; Photographs",,,,,,,,,,,,,,,,,,,,,,,,,,,,,,,,,,,,,"Photographs scanned using HP Photosmart 3210 scanner at 600 ppi, 24-bit depth.",,"Four Mounds Digital Collection",,parc_410.jpg,,7/11/2006,,,,,,,,,,,,,,,,,,,,,,,,,,,,,,,,,,,http://www.iowaheritage.org/files/original/8031c9a3d72a93581805eea907693813.jpg,"Still Image","Four Mounds Digital Collection",1,0
50731,http://www.iowaheritage.org/items/show/50731,"Gardener's house","Gardener's house|United States -- Iowa -- Dubuque County","Photograph of Gardener's house, looking sorthwest.",unknown,,,198-?,"Four Mounds Foundation","This digital image may be used for educational purposes, as long as it is not altered in any way. No commercial reproduction or distribution of this file is permitted without permission. For permission to use the digital image, please contact:  office@fourmounds.org",,"1 photograph : b&w ; 8 x 10 in|JPEG",,"Still Image; Photographs",,,,,,,,,,,,,,,,,,,,,,,,,,,,,,,,,,,,,"Photographs scanned using HP Photosmart 3210 scanner at 600 ppi, 24-bit depth.",,"Four Mounds Digital Collection",,parc_404.jpg,,7/11/2006,,,,,,,,,,,,,,,,,,,,,,,,,,,,,,,,,,,http://www.iowaheritage.org/files/original/574c09328fb4e0dcdf6b650b835275d1.jpg,"Still Image","Four Mounds Digital Collection",1,0
50687,http://www.iowaheritage.org/items/show/50687,"Chauffeur's house and Gardener's house","Chauffeur's house|United States -- Iowa -- Dubuque County|Gardener's house|Barn","Photograph of the Chauffeur's house and garage with Gardener's house and chicken coop (demolished) in background.",unknown,,,"ca. 1910-1925","Four Mounds Foundation","This digital image may be used for educational purposes, as long as it is not altered in any way. No commercial reproduction or distribution of this file is permitted without permission. For permission to use the digital image, please contact:  office@fourmounds.org",,"1 photograph : b&w ; 7.75 x 10.25 in|JPEG",,"Still Image; Photographs",,,,,,,,,,,,,,,,,,,,,,,,,,,,,,,,,,,,,"Photographs scanned using HP Scanjet 3500c scanner at 200 ppi, 24-bit depth.",,"Four Mounds Digital Collection",,parc_382.jpg,,6/26/2006,,,,,,,,,,,,,,,,,,,,,,,,,,,,,,,,,,,http://www.iowaheritage.org/files/original/b9f2585afb92bc1417c10dbfdff87e27.jpg,"Still Image","Four Mounds Digital Collection",1,0
50618,http://www.iowaheritage.org/items/show/50618,"John and Veronica by Gardener's house","Gardener's house|United States -- Iowa -- Dubuque County|Heitzman family|Heitzman, John, 1885-1976","John Heitzman and Veronica Heitzman standing by Gardener's house corner and clothesline, looking southeast.",unknown,,,1936,"Four Mounds Foundation","This digital image may be used for educational purposes, as long as it is not altered in any way. No commercial reproduction or distribution of this file is permitted without permission. For permission to use the digital image, please contact:  office@fourmounds.org",,"1 photograph : b&w ; 3.5 x 2.5 in|JPEG",,"Still Image; Photographs",,,,,,,,,,,,,,,,,,,,,,,,,,,,,,,,,,,,,"Photographs scanned using HP Scanjet 3500c scanner at 200 ppi, 24-bit depth.",,"Four Mounds Digital Collection",,parc_310.jpg,,6/22/2006,,,,,,,,,,,,,,,,,,,,,,,,,,,,,,,,,,,http://www.iowaheritage.org/files/original/333f33b4a7bf8f680d383040cec4648e.jpg,"Still Image","Four Mounds Digital Collection",1,0
50588,http://www.iowaheritage.org/items/show/50588,"Sandy James spawled out on lawn","Men--Iowa--Dubuque|United States -- Iowa -- Dubuque County|Gardener's house","Photograph of Sandy James spawled out on lawn with bottles in Heitzman's yard. Gardener's house shown, looking south.",unknown,,,unknown,"Four Mounds Foundation","This digital image may be used for educational purposes, as long as it is not altered in any way. No commercial reproduction or distribution of this file is permitted without permission. For permission to use the digital image, please contact:  office@fourmounds.org",,"1 photograph : b&w ; 1.75 x 2.5 in|JPEG",,"Still Image; Photographs",,,,,,,,,,,,,,,,,,,,,,,,,,,,,,,,,,,,,"Photographs scanned using HP Scanjet 3500c scanner at 200 ppi, 24-bit depth.",,"Four Mounds Digital Collection",,parc_280.jpg,,6/22/2006,,,,,,,,,,,,,,,,,,,,,,,,,,,,,,,,,,,http://www.iowaheritage.org/files/original/0fa229f6d5c42a704f72383a71a2f44c.jpg,"Still Image","Four Mounds Digital Collection",1,0
50404,http://www.iowaheritage.org/items/show/50404,"Skip and Leo Heitzman","Heitzman family|United States -- Iowa -- Dubuque County|Gardener's house|Heitzman, Leo, 1917-1992","Skip and Leo Heitzman seated at tables eating behind the gardener's house, women unknown.",unknown,,,197-?,"Four Mounds Foundation","This digital image may be used for educational purposes, as long as it is not altered in any way. No commercial reproduction or distribution of this file is permitted without permission. For permission to use the digital image, please contact:  office@fourmounds.org",,"1 photograph : col. ; 3.5 x 3.5 in|JPEG",,"Still Image; Photographs",,,,,,,,,,,,,,,,,,,,,,,,,,,,,,,,,,,,,"Photographs scanned using HP Scanjet 3500c scanner at 200 ppi, 24-bit depth.",,"Four Mounds Digital Collection",,parc_81.jpg,,6/16/2006,,,,,,,,,,,,,,,,,,,,,,,,,,,,,,,,,,,http://www.iowaheritage.org/files/original/2e109be038b6caf3ef3941edd5edbb20.jpg,"Still Image","Four Mounds Digital Collection",1,0
50394,http://www.iowaheritage.org/items/show/50394,"Back of Gardener's house","Gardener's house|United States -- Iowa -- Dubuque County","Photograph of the back of Gardener's house.",unknown,,,194-?,"Four Mounds Foundation","This digital image may be used for educational purposes, as long as it is not altered in any way. No commercial reproduction or distribution of this file is permitted without permission. For permission to use the digital image, please contact:  office@fourmounds.org",,"1 photograph : b&w ; 3 x 4.5 in|JPEG",,"Still Image; Photographs",,,,,,,,,,,,,,,,,,,,,,,,,,,,,,,,,,,,,"Photographs scanned using HP Scanjet 3500c scanner at 200 ppi, 24-bit depth.",,"Four Mounds Digital Collection",,parc_71.jpg,,6/15/2006,,,,,,,,,,,,,,,,,,,,,,,,,,,,,,,,,,,http://www.iowaheritage.org/files/original/110856625a967ff4cc4b0ee377f4b561.jpg,"Still Image","Four Mounds Digital Collection",1,0
