 




﻿"Item Id","Item URI","Dublin Core:Title","Dublin Core:Subject","Dublin Core:Description","Dublin Core:Creator","Dublin Core:Source","Dublin Core:Publisher","Dublin Core:Date","Dublin Core:Contributor","Dublin Core:Rights","Dublin Core:Relation","Dublin Core:Format","Dublin Core:Language","Dublin Core:Type","Dublin Core:Identifier","Dublin Core:Coverage","Item Type Metadata:Text","Item Type Metadata:Interviewer","Item Type Metadata:Interviewee","Item Type Metadata:Location","Item Type Metadata:Transcription","Item Type Metadata:Local URL","Item Type Metadata:Original Format","Item Type Metadata:Physical Dimensions","Item Type Metadata:Duration","Item Type Metadata:Compression","Item Type Metadata:Producer","Item Type Metadata:Director","Item Type Metadata:Bit Rate/Frequency","Item Type Metadata:Time Summary","Item Type Metadata:Email Body","Item Type Metadata:Subject Line","Item Type Metadata:From","Item Type Metadata:To","Item Type Metadata:CC","Item Type Metadata:BCC","Item Type Metadata:Number of Attachments","Item Type Metadata:Standards","Item Type Metadata:Objectives","Item Type Metadata:Materials","Item Type Metadata:Lesson Plan Text","Item Type Metadata:URL","Item Type Metadata:Event Type","Item Type Metadata:Participants","Item Type Metadata:Birth Date","Item Type Metadata:Birthplace","Item Type Metadata:Death Date","Item Type Metadata:Occupation","Item Type Metadata:Biographical Text","Item Type Metadata:Bibliography","Item Type Metadata:Digital Reproduction Information","Item Type Metadata:Repository","Item Type Metadata:Repository Collection","Item Type Metadata:Contact information.","Item Type Metadata:File Name","Item Type Metadata:Notes","Item Type Metadata:Digital item created","Item Type Metadata:Digital item modified","Item Type Metadata:Executive Orders","Item Type Metadata:Record Created","Item Type Metadata:Record Modified","Item Type Metadata:Transcription2","Item Type Metadata:Source URL","Omeka Legacy File:Additional Creator","Omeka Legacy File:Transcriber","Omeka Legacy File:Producer","Omeka Legacy File:Render Device","Omeka Legacy File:Render Details","Omeka Legacy File:Capture Date","Omeka Legacy File:Capture Device","Omeka Legacy File:Capture Details","Omeka Legacy File:Change History","Omeka Legacy File:Watermark","Omeka Legacy File:Encryption","Omeka Legacy File:Compression","Omeka Legacy File:Post Processing","Omeka Image File:Width","Omeka Image File:Height","Omeka Image File:Bit Depth","Omeka Image File:Channels","Omeka Image File:Exif String","Omeka Image File:Exif Array","Omeka Image File:IPTC String","Omeka Image File:IPTC Array","Omeka Video File:Bitrate","Omeka Video File:Duration","Omeka Video File:Sample Rate","Omeka Video File:Codec","Omeka Video File:Width","Omeka Video File:Height",tags,file,itemType,collection,public,featured
68262,http://www.iowaheritage.org/items/show/68262,"Couple in horse-drawn carriage, Lamont, Iowa, 1900s","Men|Women|Carriages & coaches|Horses|United States -- Iowa -- Lamont|1900-1910",,unknown,,"University of Iowa. Libraries. Iowa Women's Archives",1910/1919|2007-06-28,,"No known copyright restrictions.","Noble Photographs|Noble Photograph collection|http://www.lib.uiowa.edu/collguides/?IWA0031",,,"Still image; Text|Photographic postcards|jpeg",IWA0031|160192410|http://digital.lib.uiowa.edu/cdm/ref/collection/noble/id/474,,,,,,,,,,,,,,,,,,,,,,,,,,,,,,,,,,,,,,,,,,,,,,,,"<a href=""http://digital.lib.uiowa.edu/cdm/ref/collection/noble/id/474"" target=""_blank"">View this item in its source respository</a>",,,,,,,,,,,,,,,,,,,,,,,,,,,,,http://www.iowaheritage.org/files/original/a039d870c23be8ea1bbeecc1c0473e56.jpg,"Remote Item","Mary Noble Historical Photograph Collection",1,0
14199,http://www.iowaheritage.org/items/show/14199,"Council Bluffs, Iowa. UP","Railroad stations|Union Pacific Railroad Company|United States -- Iowa -- Pottawattamie County -- Council Bluffs|Buildings|Carriages & coaches","Two story brick depot with covered platform.  People on platform and luggage cart in foreground. ""Union Pacific transfer depot, Council Bluffs, Iowa. On Union Pacific System""--Captions on postcard.",unknown,,"University of Iowa. Libraries. Special Collections Dept.",Unknown|2006-03-16,,"Educational use only, no other permissions given. U.S. and international copyright laws may protect this digital image. Commercial use or distribution of the image is not permitted without prior permission of the copyright holder. For information see:  http://www.lib.uiowa.edu/spec-coll/help/copyright.html","John P. Vander Maas Railroadiana|John P. Vander Maas Railroadiana Collection|MSC0468|http://lib.uiowa.edu/collguides/?MSC0468|Vol. 46, Depots by county",9|14,,"Still image|Postcards|jpeg",46councilbluffs06.jpg|169946290|https://digital.lib.uiowa.edu/,,,,,,,,,,,,,,,,,,,,,,,,,,,,,,,,,,,,,,,,,,,,,,,,"<a href=""https://digital.lib.uiowa.edu/"" target=""_blank"">View this item in its source respository</a>",,,,,,,,,,,,,,,,,,,,,,,,,,,,,http://www.iowaheritage.org/files/original/c338b0e24af117a321835942a0af01ba.jpg,"Remote Item","John P. Vander Maas Railroadiana",1,0
14953,http://www.iowaheritage.org/items/show/14953,"Correctionville, Iowa. CNW","Railroad stations|Chicago and North Western Railway Company|United States -- Iowa -- Woodbury County -- Correctionville|Buildings|Carriages & coaches|Railroad signals","Single story wooden depot with signal on pole and carts. ""Railroad Photos, Basil W. Koob, Box 279, Fort Dodge, Iowa""--Photograph verso.","Koob, Basil W.",,"University of Iowa. Libraries. Special Collections Dept.",Unknown|2006-05-22,,"Educational use only, no other permissions given. U.S. and international copyright laws may protect this digital image. Commercial use or distribution of the image is not permitted without prior permission of the copyright holder. For information see:  http://www.lib.uiowa.edu/spec-coll/help/copyright.html","John P. Vander Maas Railroadiana|John P. Vander Maas Railroadiana Collection|MSC0468|http://lib.uiowa.edu/collguides/?MSC0468|Vol. 47, Depots by county",8|14,,"Still image|Photographs|jpeg",47correctionville01.jpg|169946290|https://digital.lib.uiowa.edu/,,,,,,,,,,,,,,,,,,,,,,,,,,,,,,,,,,,,,,,,,,,,,,,,"<a href=""https://digital.lib.uiowa.edu/"" target=""_blank"">View this item in its source respository</a>",,,,,,,,,,,,,,,,,,,,,,,,,,,,,http://www.iowaheritage.org/files/original/583a3b2127e22153d1955abefccea047.jpg,"Remote Item","John P. Vander Maas Railroadiana",1,0
13769,http://www.iowaheritage.org/items/show/13769,"Columbus Junction, IA. CRIP","Railroad stations|Chicago, Rock Island & Pacific Rail Road Co.|United States -- Iowa -- Louisa County -- Columbus Junction|1950-1960|Buildings|Carriages & coaches","Single story depot with cart on wooden platform.",unknown,,"University of Iowa. Libraries. Special Collections Dept.",1950-11|2005-12-23,,"Educational use only, no other permissions given. U.S. and international copyright laws may protect this digital image. Commercial use or distribution of the image is not permitted without prior permission of the copyright holder. For information see:  http://www.lib.uiowa.edu/spec-coll/help/copyright.html","John P. Vander Maas Railroadiana|John P. Vander Maas Railroadiana Collection|MSC0468|http://lib.uiowa.edu/collguides/?MSC0468|Vol. 44, Depots by county",7|11,,"Still image|Photographs|jpeg",44columbusjunction01.jpg|169946290|https://digital.lib.uiowa.edu/,,,,,,,,,,,,,,,,,,,,,,,,,,,,,,,,,,,,,,,,,,,,,,,,"<a href=""https://digital.lib.uiowa.edu/"" target=""_blank"">View this item in its source respository</a>",,,,,,,,,,,,,,,,,,,,,,,,,,,,,http://www.iowaheritage.org/files/original/a8ee9d726b1db46d36eb951944492afb.jpg,"Remote Item","John P. Vander Maas Railroadiana",1,0
13739,http://www.iowaheritage.org/items/show/13739,"Coggon, Iowa. CAN","Railroad stations|Chicago, Anamosa & Northern|United States -- Iowa -- Linn County -- Coggon|1910-1920|Buildings|Water towers|Horses|Carriages & coaches","Single story wooden depot.  Water tower and engine.  Horses and buggy.  Wooden platform. ""C.A.N. Depot Coggan Iowa""--Caption on postcard.",unknown,,"University of Iowa. Libraries. Special Collections Dept.",1912|2005-12-22,,"Educational use only, no other permissions given. U.S. and international copyright laws may protect this digital image. Commercial use or distribution of the image is not permitted without prior permission of the copyright holder. For information see:  http://www.lib.uiowa.edu/spec-coll/help/copyright.html","John P. Vander Maas Railroadiana|John P. Vander Maas Railroadiana Collection|MSC0468|http://lib.uiowa.edu/collguides/?MSC0468|Vol. 44, Depots by county",9|14,,"Still image|Postcards|jpeg",44coggon02.jpg|169946290|https://digital.lib.uiowa.edu/,,,,,,,,,,,,,,,,,,,,,,,,,,,,,,,,,,,,,,,,,,,,,,,,"<a href=""https://digital.lib.uiowa.edu/"" target=""_blank"">View this item in its source respository</a>",,,,,,,,,,,,,,,,,,,,,,,,,,,,,http://www.iowaheritage.org/files/original/21db2b0f17ac0cba0bc02ebd8ca313a4.jpg,"Remote Item","John P. Vander Maas Railroadiana",1,0
12932,http://www.iowaheritage.org/items/show/12932,"Clinton, Iowa. MILW","Railroad stations|Chicago, Rock Island & Pacific Rail Road Co.|United States -- Iowa -- Clinton County -- Clinton|1950-1960|Buildings|Carriages & coaches","Single story depot with carts parked next to it.  Light over tracks.  Other buildings beyond depot.",unknown,,"University of Iowa. Libraries. Special Collections Dept.",1950|2005-10-06,,"Educational use only, no other permissions given. U.S. and international copyright laws may protect this digital image. Commercial use or distribution of the image is not permitted without prior permission of the copyright holder. For information see:  http://www.lib.uiowa.edu/spec-coll/help/copyright.html","John P. Vander Maas Railroadiana|John P. Vander Maas Railroadiana Collection|MSC0468|http://lib.uiowa.edu/collguides/?MSC0468|Vol. 41, Depots by county",8|12,,"Still image|Photographs|jpeg",41clinton01.jpg|169946290|https://digital.lib.uiowa.edu/,,,,,,,,,,,,,,,,,,,,,,,,,,,,,,,,,,,,,,,,,,,,,,,,"<a href=""https://digital.lib.uiowa.edu/"" target=""_blank"">View this item in its source respository</a>",,,,,,,,,,,,,,,,,,,,,,,,,,,,,http://www.iowaheritage.org/files/original/84279de19fdab18998226eb6e889d4a8.jpg,"Remote Item","John P. Vander Maas Railroadiana",1,0
12969,http://www.iowaheritage.org/items/show/12969,"Clinton, Iowa.","Railroad stations|Iowa Interstate Railroad|United States -- Iowa -- Clinton County -- Clinton|Buildings|Railroad cars|Carriages & coaches","Three story brick building with train car on tracks and cart next to tree. ""I. & I. Waiting Room, Clinton, Ia""--Caption on postcard.",unknown,,"University of Iowa. Libraries. Special Collections Dept.",Unknown|2005-10-11,,"Educational use only, no other permissions given. U.S. and international copyright laws may protect this digital image. Commercial use or distribution of the image is not permitted without prior permission of the copyright holder. For information see:  http://www.lib.uiowa.edu/spec-coll/help/copyright.html","John P. Vander Maas Railroadiana|John P. Vander Maas Railroadiana Collection|MSC0468|http://lib.uiowa.edu/collguides/?MSC0468|Vol. 41, Depots by county",9|14,,"Still image|Photographs|jpeg",41clinton06.jpg|169946290|https://digital.lib.uiowa.edu/,,,,,,,,,,,,,,,,,,,,,,,,,,,,,,,,,,,,,,,,,,,,,,,,"<a href=""https://digital.lib.uiowa.edu/"" target=""_blank"">View this item in its source respository</a>",,,,,,,,,,,,,,,,,,,,,,,,,,,,,http://www.iowaheritage.org/files/original/72a31279989223a3ea327dd944e4efe2.jpg,"Remote Item","John P. Vander Maas Railroadiana",1,0
19714,http://www.iowaheritage.org/items/show/19714,"Clinton Street businesses, Iowa City, Iowa, between 1915 and 1920","Business districts|United States -- Iowa -- Iowa City|1910-1920|Carriages & coaches|Automobiles","Wagons on east side, autos on west side.","Kent, Frederick W. (Frederick Wallace), 1894-1984",,"University of Iowa. Libraries. University Archives",1915/1920|2006-07-05,,"Educational use only, no other permissions given. U.S. and international copyright laws may protect this digital object. Commercial use or distribution of the object is not permitted without prior permission of the copyright holder.","Iowa City Town and Campus Scenes|Frederick W. Kent Collection of Photographs, 1866-2000|http://www.lib.uiowa.edu/collguides/?RG30.0001.01|Prints|Scenes -- Iowa City|Street scenes, Business district|Street scenes, Business district|Scanned with Ricoh Aficio 3228C @ 300 ppi. Master image saved in TIFF format.|http://www.flickr.com/photos/uiowa/3448732936",8|13,,"Still image|Photographs|jpeg",RG30.0001.01|0024|street024.jpg|168413524|3448732936|https://digital.lib.uiowa.edu/,,,,,,,,,,,,,,,,,,,,,,,,,,,,,,,,,,,,,,,,,,,,,,,,"<a href=""https://digital.lib.uiowa.edu/"" target=""_blank"">View this item in its source respository</a>",,,,,,,,,,,,,,,,,,,,,,,,,,,,,http://www.iowaheritage.org/files/original/bbe5bb12255f46125fda5f6fb8f7474b.jpg,"Remote Item","Iowa City Town and Campus Scenes",1,0
24987,http://www.iowaheritage.org/items/show/24987,"Class picnic, The University of Iowa, 1890s","Universities & colleges|University of Iowa|United States -- Iowa -- Iowa City|1890-1900|Students|Celebrations|Parades & processions|Carriages & coaches|Horses|Picnics",,"Kent, Frederick W. (Frederick Wallace), 1894-1984",,"University of Iowa. Libraries. University Archives",1890/1899|2008-05,,"Educational use only, no other permissions given. U.S. and international copyright laws may protect this digital object. Commercial use or distribution of the object is not permitted without prior permission of the copyright holder.","Iowa City Town and Campus Scenes|Frederick W. Kent Collection of Photographs, 1866-2000|http://www.lib.uiowa.edu/collguides/?RG30.0001.01|Prints|Events and activities|Senior Frolic|Senior Frolic|Scanned with Ricoh Aficio 3228C @ 600 ppi, full color. Master image saved in TIFF format.",11|13,,"Still image|Photographs|jpeg",RG30.0001.01|ea1355.jpg|https://digital.lib.uiowa.edu/,,,,,,,,,,,,,,,,,,,,,,,,,,,,,,,,,,,,,,,,,,,,,,,,"<a href=""https://digital.lib.uiowa.edu/"" target=""_blank"">View this item in its source respository</a>",,,,,,,,,,,,,,,,,,,,,,,,,,,,,http://www.iowaheritage.org/files/original/a33bb05523c72e43f4009ce0f7bf3fe8.jpg,"Remote Item","Iowa City Town and Campus Scenes",1,0
24985,http://www.iowaheritage.org/items/show/24985,"Class picnic, The University of Iowa, 1890s","Universities & colleges|University of Iowa|United States -- Iowa -- Iowa City|1890-1900|Students|Celebrations|Parades & processions|Carriages & coaches|Horses|Picnics",,"Kent, Frederick W. (Frederick Wallace), 1894-1984",,"University of Iowa. Libraries. University Archives",1890/1899|2008-05,,"Educational use only, no other permissions given. U.S. and international copyright laws may protect this digital object. Commercial use or distribution of the object is not permitted without prior permission of the copyright holder.","Iowa City Town and Campus Scenes|Frederick W. Kent Collection of Photographs, 1866-2000|http://www.lib.uiowa.edu/collguides/?RG30.0001.01|Prints|Events and activities|Senior Frolic|Senior Frolic|Scanned with Ricoh Aficio 3228C @ 600 ppi, full color. Master image saved in TIFF format.",11|13,,"Still image|Photographs|jpeg",RG30.0001.01|ea1354.jpg|https://digital.lib.uiowa.edu/,,,,,,,,,,,,,,,,,,,,,,,,,,,,,,,,,,,,,,,,,,,,,,,,"<a href=""https://digital.lib.uiowa.edu/"" target=""_blank"">View this item in its source respository</a>",,,,,,,,,,,,,,,,,,,,,,,,,,,,,http://www.iowaheritage.org/files/original/642edeaf171868b2d792453c26e1556f.jpg,"Remote Item","Iowa City Town and Campus Scenes",1,0
