 




﻿"Item Id","Item URI","Dublin Core:Title","Dublin Core:Subject","Dublin Core:Description","Dublin Core:Creator","Dublin Core:Source","Dublin Core:Publisher","Dublin Core:Date","Dublin Core:Contributor","Dublin Core:Rights","Dublin Core:Relation","Dublin Core:Format","Dublin Core:Language","Dublin Core:Type","Dublin Core:Identifier","Dublin Core:Coverage","Item Type Metadata:Text","Item Type Metadata:Interviewer","Item Type Metadata:Interviewee","Item Type Metadata:Location","Item Type Metadata:Transcription","Item Type Metadata:Local URL","Item Type Metadata:Original Format","Item Type Metadata:Physical Dimensions","Item Type Metadata:Duration","Item Type Metadata:Compression","Item Type Metadata:Producer","Item Type Metadata:Director","Item Type Metadata:Bit Rate/Frequency","Item Type Metadata:Time Summary","Item Type Metadata:Email Body","Item Type Metadata:Subject Line","Item Type Metadata:From","Item Type Metadata:To","Item Type Metadata:CC","Item Type Metadata:BCC","Item Type Metadata:Number of Attachments","Item Type Metadata:Standards","Item Type Metadata:Objectives","Item Type Metadata:Materials","Item Type Metadata:Lesson Plan Text","Item Type Metadata:URL","Item Type Metadata:Event Type","Item Type Metadata:Participants","Item Type Metadata:Birth Date","Item Type Metadata:Birthplace","Item Type Metadata:Death Date","Item Type Metadata:Occupation","Item Type Metadata:Biographical Text","Item Type Metadata:Bibliography","Item Type Metadata:Digital Reproduction Information","Item Type Metadata:Repository","Item Type Metadata:Repository Collection","Item Type Metadata:Contact information.","Item Type Metadata:File Name","Item Type Metadata:Notes","Item Type Metadata:Digital item created","Item Type Metadata:Digital item modified","Item Type Metadata:Executive Orders","Item Type Metadata:Record Created","Item Type Metadata:Record Modified","Item Type Metadata:Transcription2","Item Type Metadata:Source URL","Omeka Legacy File:Additional Creator","Omeka Legacy File:Transcriber","Omeka Legacy File:Producer","Omeka Legacy File:Render Device","Omeka Legacy File:Render Details","Omeka Legacy File:Capture Date","Omeka Legacy File:Capture Device","Omeka Legacy File:Capture Details","Omeka Legacy File:Change History","Omeka Legacy File:Watermark","Omeka Legacy File:Encryption","Omeka Legacy File:Compression","Omeka Legacy File:Post Processing","Omeka Image File:Width","Omeka Image File:Height","Omeka Image File:Bit Depth","Omeka Image File:Channels","Omeka Image File:Exif String","Omeka Image File:Exif Array","Omeka Image File:IPTC String","Omeka Image File:IPTC Array","Omeka Video File:Bitrate","Omeka Video File:Duration","Omeka Video File:Sample Rate","Omeka Video File:Codec","Omeka Video File:Width","Omeka Video File:Height",tags,file,itemType,collection,public,featured
15901,http://www.iowaheritage.org/items/show/15901,"Robert J. Moyle letters, 1862-1906","War|United States -- History -- Civil War, 1861-1865|Moyle, Robert J., 1838-1864|United States. Army. Iowa Infantry Regiment, 25th (1862-1865)|United States|1860-1870|Campaigns & battles|Military life|Vicksburg (Miss.) -- History -- Siege, 1863|United States -- Mississippi -- Vicksburg|United States -- Georgia -- Dallas|United States -- Iowa-- Hillsboro","Moyle, a resident of Hillsboro, Iowa, (Henry Co.), was a member of the 25th Regiment of Iowa Volunteers and participated in the siege of Vicksburg and encounters at Dallas, Georgia. His letters, addressed to his parents, include descriptions of battles, camps, and the health of the troops. He injured his leg in a barge accident, contracted typhoid fever, and died on June 27, 1864 at Boston Iron Works, Georgia.","Moyle, Robert J., 1838-1864",,"University of Iowa. Libraries. Special Collections Dept.",1862/1906,,"Educational use only, no other permissions given. U.S. and international copyright laws may protect this digital image. Commercial use or distribution of the image is not permitted without prior permission of the copyright holder.","Civil War Diaries and Letters|Civil War, 1861-1865|http://www.lib.uiowa.edu/spec-coll/resources/CivilWarResources.html#civilwar",,,"Text|Correspondence; Envelopes; Notes|jpeg","MsL M938 c|index.cpd|https://digital.lib.uiowa.edu/",,,,,,,,,,,,,,,,,,,,,,,,,,,,,,,,,,,,,,,,,,,,,,,,"<a href=""https://digital.lib.uiowa.edu/"" target=""_blank"">View this item in its source respository</a>",,,,,,,,,,,,,,,,,,,,,,,,,,,,,http://www.iowaheritage.org/files/original/567594c7333b646104f1a8887ca4ca8e.jpg,"Remote Item","Civil War Diaries and Letters",1,0
15810,http://www.iowaheritage.org/items/show/15810,"Rufus Nelson Merriam documents, 1900s?-1996","War|United States -- History -- Civil War, 1861-1865|Nelson, Rufus Merriam, 1837-1905|United States. Army. Iowa Infantry Regiment, 4th (1861-1865)|United States|Soldiers|Military life|Family trees|Families","Rufus Nelson Merriam served with the 4th Iowa Infantry, Company B.","Merriam, Rufus Nelson, 1837-1905",,"University of Iowa. Libraries. Special Collections Dept.",1900/1996,,"Educational use only, no other permissions given. U.S. and international copyright laws may protect this digital image. Commercial use or distribution of the image is not permitted without prior permission of the copyright holder.","Civil War Diaries and Letters|Civil War Collection|http://www.lib.uiowa.edu/spec-coll/msc/ToMsC950/MsC906/CivilWarCollection.html",,,"Text|Memoirs; Correspondence; Genealogies|jpeg",MsC906|index.cpd|https://digital.lib.uiowa.edu/,,,,,,,,,,,,,,,,,,,,,,,,,,,,,,,,,,,,,,,,,,,,,,,,"<a href=""https://digital.lib.uiowa.edu/"" target=""_blank"">View this item in its source respository</a>",,,,,,,,,,,,,,,,,,,,,,,,,,,,,http://www.iowaheritage.org/files/original/5e0938efe0f45b400c88fc62a921003b.jpg,"Remote Item","Civil War Diaries and Letters",1,0
15497,http://www.iowaheritage.org/items/show/15497,"Samuel Hall diary, 1863","Soldiers|United States -- History -- Civil War, 1861-1865|Hall, Samuel|1860-1870|Gettysburg, Battle of, Gettysburg, Pa., 1863","Samuel Hall was a soldier during the Civil War.  He was taken prisoner of war at Gettysburg July 2, 1863.","Hall, Samuel.",,"University of Iowa. Libraries. Special Collections Dept.",1863|2008-01-11,,"Educational use only, no other permissions given. U.S. and international copyright laws may protect this digital image. Commercial use or distribution of the image is not permitted without prior permission of the copyright holder.","Civil War Diaries and Letters; Abraham Lincoln Collection|Civil War, 1861-1865|n/a",,,Text|Diaries|jpeg,MSC0089|31858055130037|https://digital.lib.uiowa.edu/,,,,,,,,,,,,,,,,,,,,,,,,,,,,,,,,,,,,,,,,,,,,,,,,"<a href=""https://digital.lib.uiowa.edu/"" target=""_blank"">View this item in its source respository</a>",,,,,,,,,,,,,,,,,,,,,,,,,,,,,http://www.iowaheritage.org/files/original/ebc715db9ba93001fdda3ce757668fc2.jpg,"Remote Item","Civil War Diaries and Letters",1,0
15774,http://www.iowaheritage.org/items/show/15774,"Samuel R. Curtis military pass, October 13, 1861","Guards|United States -- History -- Civil War, 1861-1865|Curtis, H. Z.|United States -- Missouri -- Benton Barracks (St. Louis)|1860-1870|Blockades|Military officers|Soldiers|Curtis, Samuel Ryan, 1805-1890",,"Curtis, Samuel Ryan, 1805-1890",,"University of Iowa. Libraries. Special Collections Dept.",1861-10-13,,"Educational use only, no other permissions given. U.S. and international copyright laws may protect this digital image. Commercial use or distribution of the image is not permitted without prior permission of the copyright holder.","Civil War Diaries and Letters|Civil War Collection|http://www.lib.uiowa.edu/spec-coll/msc/ToMsC950/MsC906/CivilWarCollection.html",,,"Text|Military passes|jpeg",MsC906|index.cpd|https://digital.lib.uiowa.edu/,,,,,,,,,,,,,,,,,,,,,,,,,,,,,,,,,,,,,,,,,,,,,,,,"<a href=""https://digital.lib.uiowa.edu/"" target=""_blank"">View this item in its source respository</a>",,,,,,,,,,,,,,,,,,,,,,,,,,,,,http://www.iowaheritage.org/files/original/ab7b961bbc96177a1828d41d868d28fc.jpg,"Remote Item","Civil War Diaries and Letters",1,0
15491,http://www.iowaheritage.org/items/show/15491,"Sewell Van Alstine diary, 1863-1864","Soldiers|United States -- History -- Civil War, 1861-1865|Van Alstine, Sewell|United States. Army. Illinois Infantry Regiment, 95th (1862-1865). Company K.|United States -- Illinois|1860-1870","Sewell Van Alstine describes his experiences as a soldier in the 95th Illinois Infantry during the Civil War. Diary contains entries from September 1863 to October 1864.  Van Alstine is also featured in the Iowa Authors Collection.","Van Alstine, Sewell",,"University of Iowa. Libraries. Special Collections Dept.",1863/1864|2007-11-30,,"Educational use only, no other permissions given. U.S. and international copyright laws may protect this digital image. Commercial use or distribution of the image is not permitted without prior permission of the copyright holder.","Civil War Diaries and Letters; Abraham Lincoln Collection|Sewell Van Alstine papers|http://lib.uiowa.edu/collguides/?MSC0028",16|10,,Text|Diaries|jpeg,MSC0028|31858055129971|https://digital.lib.uiowa.edu/,,,,,,,,,,,,,,,,,,,,,,,,,,,,,,,,,,,,,,,,,,,,,,,,"<a href=""https://digital.lib.uiowa.edu/"" target=""_blank"">View this item in its source respository</a>",,,,,,,,,,,,,,,,,,,,,,,,,,,,,http://www.iowaheritage.org/files/original/9ad1dc1bbe93b181da57943509a347ee.jpg,"Remote Item","Civil War Diaries and Letters",1,0
15515,http://www.iowaheritage.org/items/show/15515,"Shelton family papers, 1864-1936","Soldiers|United States -- History -- Civil War, 1861-1865|Shelton, O. C.|United States. Army. Iowa Infantry Regiment, 45th (1864). Company G|United States -- Iowa -- Mount Pleasant|1860-1870|War casualties|Sick persons|Military camps|Military hospitals|Prisoners of war|Military officers|Guards|Courtship|Campaigns & battles|Writing|Reading|Christianity|Slaves|Freedmen|Orphanages|Mental institutions|Teachers|Spies|Women's rights|Assassinations|Kitchens|Cooks|Nursing|Housework|Train travel|Ships|Philanthropy|Andersonville Prison|Atlanta Campaign, 1864|African Americans|African American soldiers|Chickamauga Battlefield (Ga.)|Bookkeepers|Shelton, Mary E.|Shelton, Rhoda Amanda|Wittenmyer, Annie, 1827-1900|Lincoln, Abraham, 1809-1865|United States Christian Commission|United States Sanitary Commission|Burlington hawk-eye|Lucy Bertram (Steamer)|Ladies' Soldiers' Aid Society (Keokuk, Iowa)|Iowa Soldiers' Orphans' Home (Davenport, Iowa)|Iowa Wesleyan College|Mount Pleasant State Hospital (Mount Pleasant, Iowa)|Spanish-American War Veterans|Mississippi Valley Historical Association|United States -- Iowa -- Burlington|United States -- Iowa -- Keokuk|United States -- Iowa -- Des Moines|United States -- Tennessee -- Memphis|United States -- Tennessee -- Nashville|United States -- Tennessee -- Chattanooga|United States -- Washington (D.C.)|United States -- Virginia -- Alexandria|United States -- Delaware -- Wilmington|United States -- Kentucky -- Louisville|United States -- Tennessee -- Lookout Mountain|United States -- Mississippi -- Vicksburg|1930-1940","Diaries of siblings O.C., Mary, and R. Amanda Shelton from the 1860s and a speech written by R. Amanda Shelton in 1911 about her experiences during the Civil War. O.C. Shelton served as an officer in the Iowa Infantry 45th Regiment and died of illness shortly after returning home; his sisters, under the guidance of Annie Wittenmeyer, helped set up ""diet kitchens"" in Union military hospitals in the South and tended to wounded soldiers.","Shelton, O. C.; Shelton Mary E.; Shelton, Rhoda Amanda",,"University of Iowa. Libraries. Special Collections Dept.",1864/1936|2008-10-15,,"Educational use only, no other permissions given. U.S. and international copyright laws may protect this digital image. Commercial use or distribution of the image is not permitted without prior permission of the copyright holder.","Civil War Diaries and Letters; Abraham Lincoln Collection|Shelton Family Papers|http://lib.uiowa.edu/collguides/?MSC0007",,,"Text|Diaries; Speeches; Obituaries; Military passes|jpeg",MSC0007|31858055128080|https://digital.lib.uiowa.edu/,,,,,,,,,,,,,,,,,,,,,,,,,,,,,,,,,,,,,,,,,,,,,,,,"<a href=""https://digital.lib.uiowa.edu/"" target=""_blank"">View this item in its source respository</a>",,,,,,,,,,,,,,,,,,,,,,,,,,,,,http://www.iowaheritage.org/files/original/e566cfd344ba50aac2cd901d3bddcb8a.jpg,"Remote Item","Civil War Diaries and Letters",1,0
15727,http://www.iowaheritage.org/items/show/15727,"Silas B. Silver diary, 1863","Physicians|United States -- History -- Civil War, 1861-1865|Silver, Silas B.|United States -- Maryland -- Harford County -- Glenville|1860-1870|","Silas B. Silver was a physician in Glenville, Harford County, Maryland, in the mid-nineteenth century.","Silver, Silas B.",,"University of Iowa. Libraries. Special Collections Dept.",1863,,"Educational use only, no other permissions given. U.S. and international copyright laws may protect this digital image. Commercial use or distribution of the image is not permitted without prior permission of the copyright holder.","Civil War Diaries and Letters; Abraham Lincoln Collection|Silas B. Silver diary|http://lib.uiowa.edu/collguides/?MSC0012",,,Text|Diaries|jpeg,MSC0012|31858055130078|https://digital.lib.uiowa.edu/,,,,,,,,,,,,,,,,,,,,,,,,,,,,,,,,,,,,,,,,,,,,,,,,"<a href=""https://digital.lib.uiowa.edu/"" target=""_blank"">View this item in its source respository</a>",,,,,,,,,,,,,,,,,,,,,,,,,,,,,http://www.iowaheritage.org/files/original/738f1530b6417464c40dca6ebc6f9e0d.jpg,"Remote Item","Civil War Diaries and Letters",1,0
15804,http://www.iowaheritage.org/items/show/15804,"Some recollections of my father's family, 1926","Soldiers|United States -- History -- Civil War, 1861-1865|Kimberly, Wesley Clark|United States. Army. Iowa Cavalry Regiment, 1st (1861-1866)|United States|1920-1930|War|Frontier & pioneer life|Kimberly, William|Kimberly, Phebe","Includes information on 1st Iowa Cavalry, 1861-1866.","Kimberly, Wesley Clark",,"University of Iowa. Libraries. Special Collections Dept.",1926,,"Educational use only, no other permissions given. U.S. and international copyright laws may protect this digital image. Commercial use or distribution of the image is not permitted without prior permission of the copyright holder.","Civil War Diaries and Letters|Civil War Collection|http://www.lib.uiowa.edu/spec-coll/msc/ToMsC950/MsC906/CivilWarCollection.html",,,"Text; Still image|Memoirs; Typescript|jpeg",MsC906|index.cpd|https://digital.lib.uiowa.edu/,,,,,,,,,,,,,,,,,,,,,,,,,,,,,,,,,,,,,,,,,,,,,,,,"<a href=""https://digital.lib.uiowa.edu/"" target=""_blank"">View this item in its source respository</a>",,,,,,,,,,,,,,,,,,,,,,,,,,,,,http://www.iowaheritage.org/files/original/423a3ac6a5bf1d9fc39f29e8d8fe744c.jpg,"Remote Item","Civil War Diaries and Letters",1,0
15715,http://www.iowaheritage.org/items/show/15715,"Sterns family papers, April-June 1863","War|United States -- History -- Civil War, 1861-1865|Sterns, Thomas Rescum, 1839-1863|United States. Army. Wisconsin Infantry Regiment, 29th (1862-1865). Company F|United States|1860-1870|Soldiers","Wartime experiences of Thomas Rescum Sterns, who joined the army in 1862, served with the Wisconsin Volunteers and died in 1863.","Sterns, Thomas Rescum, 1839-1863",,"University of Iowa. Libraries. Special Collections Dept.",1863-04/1863-06,,"Educational use only, no other permissions given. U.S. and international copyright laws may protect this digital image. Commercial use or distribution of the image is not permitted without prior permission of the copyright holder.","Civil War Diaries and Letters|Sterns Family papers|http://lib.uiowa.edu/collguides/?MSC0405",,,"Text|Correspondence; Envelopes|jpeg",MSC0405|index.cpd|31858055129054|https://digital.lib.uiowa.edu/,,,,,,,,,,,,,,,,,,,,,,,,,,,,,,,,,,,,,,,,,,,,,,,,"<a href=""https://digital.lib.uiowa.edu/"" target=""_blank"">View this item in its source respository</a>",,,,,,,,,,,,,,,,,,,,,,,,,,,,,http://www.iowaheritage.org/files/original/fe5801a7c8252fa31ed3d243091de3af.jpg,"Remote Item","Civil War Diaries and Letters",1,0
15713,http://www.iowaheritage.org/items/show/15713,"Sterns family papers, January-March 1863","War|United States -- History -- Civil War, 1861-1865|Sterns, Thomas Rescum, 1839-1863|United States. Army. Wisconsin Infantry Regiment, 29th (1862-1865). Company F|United States|1860-1870|Soldiers","Wartime experiences of Thomas Rescum Sterns, who joined the army in 1862, served with the Wisconsin Volunteers and died in 1863.","Sterns, Thomas Rescum, 1839-1863",,"University of Iowa. Libraries. Special Collections Dept.",1863-01/1863-03,,"Educational use only, no other permissions given. U.S. and international copyright laws may protect this digital image. Commercial use or distribution of the image is not permitted without prior permission of the copyright holder.","Civil War Diaries and Letters|Sterns Family papers|http://lib.uiowa.edu/collguides/?MSC0405",,,"Text|Correspondence; Envelopes|jpeg",MSC0405|index.cpd|31858055129047|https://digital.lib.uiowa.edu/,,,,,,,,,,,,,,,,,,,,,,,,,,,,,,,,,,,,,,,,,,,,,,,,"<a href=""https://digital.lib.uiowa.edu/"" target=""_blank"">View this item in its source respository</a>",,,,,,,,,,,,,,,,,,,,,,,,,,,,,http://www.iowaheritage.org/files/original/1f01b1d4cc22302b64f4d53b69f75bf4.jpg,"Remote Item","Civil War Diaries and Letters",1,0
