 




﻿"Item Id","Item URI","Dublin Core:Title","Dublin Core:Subject","Dublin Core:Description","Dublin Core:Creator","Dublin Core:Source","Dublin Core:Publisher","Dublin Core:Date","Dublin Core:Contributor","Dublin Core:Rights","Dublin Core:Relation","Dublin Core:Format","Dublin Core:Language","Dublin Core:Type","Dublin Core:Identifier","Dublin Core:Coverage","Item Type Metadata:Text","Item Type Metadata:Interviewer","Item Type Metadata:Interviewee","Item Type Metadata:Location","Item Type Metadata:Transcription","Item Type Metadata:Local URL","Item Type Metadata:Original Format","Item Type Metadata:Physical Dimensions","Item Type Metadata:Duration","Item Type Metadata:Compression","Item Type Metadata:Producer","Item Type Metadata:Director","Item Type Metadata:Bit Rate/Frequency","Item Type Metadata:Time Summary","Item Type Metadata:Email Body","Item Type Metadata:Subject Line","Item Type Metadata:From","Item Type Metadata:To","Item Type Metadata:CC","Item Type Metadata:BCC","Item Type Metadata:Number of Attachments","Item Type Metadata:Standards","Item Type Metadata:Objectives","Item Type Metadata:Materials","Item Type Metadata:Lesson Plan Text","Item Type Metadata:URL","Item Type Metadata:Event Type","Item Type Metadata:Participants","Item Type Metadata:Birth Date","Item Type Metadata:Birthplace","Item Type Metadata:Death Date","Item Type Metadata:Occupation","Item Type Metadata:Biographical Text","Item Type Metadata:Bibliography","Item Type Metadata:Digital Reproduction Information","Item Type Metadata:Repository","Item Type Metadata:Repository Collection","Item Type Metadata:Contact information.","Item Type Metadata:File Name","Item Type Metadata:Notes","Item Type Metadata:Digital item created","Item Type Metadata:Digital item modified","Item Type Metadata:Executive Orders","Item Type Metadata:Record Created","Item Type Metadata:Record Modified","Item Type Metadata:Transcription2","Item Type Metadata:Source URL","Omeka Legacy File:Additional Creator","Omeka Legacy File:Transcriber","Omeka Legacy File:Producer","Omeka Legacy File:Render Device","Omeka Legacy File:Render Details","Omeka Legacy File:Capture Date","Omeka Legacy File:Capture Device","Omeka Legacy File:Capture Details","Omeka Legacy File:Change History","Omeka Legacy File:Watermark","Omeka Legacy File:Encryption","Omeka Legacy File:Compression","Omeka Legacy File:Post Processing","Omeka Image File:Width","Omeka Image File:Height","Omeka Image File:Bit Depth","Omeka Image File:Channels","Omeka Image File:Exif String","Omeka Image File:Exif Array","Omeka Image File:IPTC String","Omeka Image File:IPTC Array","Omeka Video File:Bitrate","Omeka Video File:Duration","Omeka Video File:Sample Rate","Omeka Video File:Codec","Omeka Video File:Width","Omeka Video File:Height",tags,file,itemType,collection,public,featured
2694,http://www.iowaheritage.org/items/show/2694,"Des Moines River|View on Des Moines River",Rivers|Trees|Plants,"Unknown view along Des Moines River.",,"Special Collections, Cowles Library -- Drake University.","Chicago, Il. : Gravure Illustration Co.",1914|2005/05/25,,"U.S. and International copyright laws protect this digital image. Commercial use or distribution of the image is not permitted without prior permission of the copyright holder. For permission to use the digital image, please contact: bart.schmidt@drake.edu","Art Work of Des Moines -- Book One","Photographic print, 4.5 x 7 in.",,Image,"v. 1, p. 2|dm0003|http://ddr.lib.drake.edu/u?/du-hdm,43",,,,,,,,,,,,,,,,,,,,,,,,,,,,,,,,,,,,,,,,,,,,,,,,"<a href=""http://ddr.lib.drake.edu/u?/du-hdm,43"" target=""_blank"">View this item in its source respository</a>",,,,,,,,,,,,,,,,,,,,,,,,,,,,,http://www.iowaheritage.org/files/original/cbf383ab58eafad9355d936418365b0c.jpg,"Remote Item","Des Moines University Historic Photograph Collection",1,0
2693,http://www.iowaheritage.org/items/show/2693,"Des Moines River|Scene on Des Moines River",Rivers|Trees,"Unknown view of the Des Moines River.",,"Special Collections, Cowles Library -- Drake University.","Chicago, Il. : Gravure Illustration Co.",1914|2005/04/25,,"U.S. and International copyright laws protect this digital image. Commercial use or distribution of the image is not permitted without prior permission of the copyright holder. For permission to use the digital image, please contact: bart.schmidt@drake.edu","Art Work of Des Moines -- Book One","Photographic print, 4.5 x 7 in.",,Image,"v. 1, p. 7|dm0011|http://ddr.lib.drake.edu/u?/du-hdm,42",,,,,,,,,,,,,,,,,,,,,,,,,,,,,,,,,,,,,,,,,,,,,,,,"<a href=""http://ddr.lib.drake.edu/u?/du-hdm,42"" target=""_blank"">View this item in its source respository</a>",,,,,,,,,,,,,,,,,,,,,,,,,,,,,http://www.iowaheritage.org/files/original/ef312cf2ff48da08ce3cbf7f4bfe4243.jpg,"Remote Item","Des Moines University Historic Photograph Collection",1,0
2691,http://www.iowaheritage.org/items/show/2691,"Country Club Blvd., Frank C. Waterbury Residence|Residence of  F. C. Waterbury",Houses|Driveways|Trees,"This house was built in 1900 and is still standing. It was the home of Frank C. Waterbury and his wife Coral. Mr. Waterbury was the president of the Waterbury Chemical Co. and was involved in many investment companies. He also served as Vice President of the Des Moines College of Pharmacy, which later merged with Drake University to become the Drake College of Pharmacy and Health Sciences.",,"Special Collections, Cowles Library -- Drake University.","Chicago, Il. : Gravure Illustration Co.",1914|2005/04/25,,"U.S. and International copyright laws protect this digital image. Commercial use or distribution of the image is not permitted without prior permission of the copyright holder. For permission to use the digital image, please contact: bart.schmidt@drake.edu","Art Work of Des Moines -- Book Two","Photographic print, 4.5 x 7 in.",,Image,"v. 2, p. 3|dm0026|http://ddr.lib.drake.edu/u?/du-hdm,40","607 Country Club Blvd.",,,,,,,,,,,,,,,,,,,,,,,,,,,,,,,,,,,,,,,,,,,,,,,"<a href=""http://ddr.lib.drake.edu/u?/du-hdm,40"" target=""_blank"">View this item in its source respository</a>",,,,,,,,,,,,,,,,,,,,,,,,,,,,,http://www.iowaheritage.org/files/original/e6a0d64cd28a7f9ed32f453cf7921fdc.jpg,"Remote Item","Des Moines University Historic Photograph Collection",1,0
2690,http://www.iowaheritage.org/items/show/2690,"Country Club Blvd, C. R. Prouty Residence|Residence of C. R. Prouty",Houses|Driveways|Trees,"Built in 1914, this house on Country Club Blvd. is still standing. Mr. Prouty was the Vice President of the C.C. Prouty Co., a wholesale grocery company.",,"Special Collections, Cowles Library -- Drake University.","Chicago, Il. : Gravure Illustration Co.",1914|2005/04/25,,"U.S. and International copyright laws protect this digital image. Commercial use or distribution of the image is not permitted without prior permission of the copyright holder. For permission to use the digital image, please contact: bart.schmidt@drake.edu","Art Work of Des Moines -- Book One","Photographic print, 4.5 x 7 in.",,Image,"v. 1, p. 11|dm0017|http://ddr.lib.drake.edu/u?/du-hdm,39","5015 Country Club Blvd.",,,,,,,,,,,,,,,,,,,,,,,,,,,,,,,,,,,,,,,,,,,,,,,"<a href=""http://ddr.lib.drake.edu/u?/du-hdm,39"" target=""_blank"">View this item in its source respository</a>",,,,,,,,,,,,,,,,,,,,,,,,,,,,,http://www.iowaheritage.org/files/original/9cff7b9811ea8fb940e5f4506b325da1.jpg,"Remote Item","Des Moines University Historic Photograph Collection",1,0
2689,http://www.iowaheritage.org/items/show/2689,"42nd Street, Edwin Thomas Meredith Residence|Residence of E. T. Meredith",Houses|Trees|Awnings,"This house on 42nd Street was the home of E. T. Meredith and his wife Edna. Mr. Meredith was the president and manager of the Successful Farming Publishing Company. Unsuccessful in his 1914 bid for U.S. Senate and his 1916 bid for Governor of Iowa, Mr. Meredith was appointed Secretary of Agriculture by President Wilson. Current site of an apartment building.",,"Special Collections, Cowles Library -- Drake University.","Chicago, Il. : Gravure Illustration Co.",1914|2005/04/25,,"U.S. and International copyright laws protect this digital image. Commercial use or distribution of the image is not permitted without prior permission of the copyright holder. For permission to use the digital image, please contact: bart.schmidt@drake.edu","Art Work of Des Moines -- Book Two","Photographic print, 4.5 x 7 in.",,Image,"v. 2, p. 3|dm0025|http://ddr.lib.drake.edu/u?/du-hdm,38","600 42nd St.",,,,,,,,,,,,,,,,,,,,,,,,,,,,,,,,,,,,,,,,,,,,,,,"<a href=""http://ddr.lib.drake.edu/u?/du-hdm,38"" target=""_blank"">View this item in its source respository</a>",,,,,,,,,,,,,,,,,,,,,,,,,,,,,http://www.iowaheritage.org/files/original/91387e258086f8f4cdbf620a398fc994.jpg,"Remote Item","Des Moines University Historic Photograph Collection",1,0
2688,http://www.iowaheritage.org/items/show/2688,"37th Street, H.C. Wallace Residence|Residence of Henry Cantwell Wallace",Houses|Driveways|Automobiles|Trees,"Built in 1912 for Henry and Carrie Wallace, this house still stands on 37th street. Mr. Wallace was General Manager of the Wallace Publishing Co., and President of the North Western Live Stock Insurance Company. Mr. Wallace went on to serve as Secretary of Agriculture for both President Harding and President Coolidge.",,"Special Collections, Cowles Library -- Drake University.","Chicago, Il. : Gravure Illustration Co.",1914|2005/04/25,,"U.S. and International copyright laws protect this digital image. Commercial use or distribution of the image is not permitted without prior permission of the copyright holder. For permission to use the digital image, please contact: bart.schmidt@drake.edu","Art Work of Des Moines -- Book One","Photographic print, 4.5 x 7 in.",,Image,"v. 1, p. 3|dm0005|http://ddr.lib.drake.edu/u?/du-hdm,37","50 37th St.",,,,,,,,,,,,,,,,,,,,,,,,,,,,,,,,,,,,,,,,,,,,,,,"<a href=""http://ddr.lib.drake.edu/u?/du-hdm,37"" target=""_blank"">View this item in its source respository</a>",,,,,,,,,,,,,,,,,,,,,,,,,,,,,http://www.iowaheritage.org/files/original/171b3e7b0d5af53e7a8abade0bbc7cac.jpg,"Remote Item","Des Moines University Historic Photograph Collection",1,0
2687,http://www.iowaheritage.org/items/show/2687,"37th Street, C. L. Herring Residence|Residence of Clyde Laverne Herring",Houses|Trees,"In 1910 Mr. Herring and his wife Emma moved to this home in Des Moines. He was the president of Herring Motor Company. He became governor of Iowa in 1935 and served until 1943. He later served in the U.S. Senate from 1937 - 1943.",,"Special Collections, Cowles Library -- Drake University.","Chicago, Il. : Gravure Illustration Co.",1914|2005/04/25,,"U.S. and International copyright laws protect this digital image. Commercial use or distribution of the image is not permitted without prior permission of the copyright holder. For permission to use the digital image, please contact: bart.schmidt@drake.edu","Art Work of Des Moines -- Book One","Photographic print, 4.5 x 7 in.",,Image,"v. 1, p. 9|dm0014|http://ddr.lib.drake.edu/u?/du-hdm,36","180 37th St.",,,,,,,,,,,,,,,,,,,,,,,,,,,,,,,,,,,,,,,,,,,,,,,"<a href=""http://ddr.lib.drake.edu/u?/du-hdm,36"" target=""_blank"">View this item in its source respository</a>",,,,,,,,,,,,,,,,,,,,,,,,,,,,,http://www.iowaheritage.org/files/original/932055f2b8ac54674ab1d4defaad1b2a.jpg,"Remote Item","Des Moines University Historic Photograph Collection",1,0
2686,http://www.iowaheritage.org/items/show/2686,"37th Street, Addison M. Parker Residence|Residence of Addison M. Parker",Houses|Driveways|Trees,"This house on 37th street was built in 1914 for the Addison Parker family. Mr. Parker was a lawyer with the law firm Parker and Hartman.",,"Special Collections, Cowles Library -- Drake University.","Chicago, Il. : Gravure Illustration Co.",1914|2005/04/25,,"U.S. and International copyright laws protect this digital image. Commercial use or distribution of the image is not permitted without prior permission of the copyright holder. For permission to use the digital image, please contact: bart.schmidt@drake.edu","Art Work of Des Moines -- Book One","Photographic print, 4.5 x 7 in.",,Image,"v. 1, p. 9|dm0015|http://ddr.lib.drake.edu/u?/du-hdm,35","141 37th St.",,,,,,,,,,,,,,,,,,,,,,,,,,,,,,,,,,,,,,,,,,,,,,,"<a href=""http://ddr.lib.drake.edu/u?/du-hdm,35"" target=""_blank"">View this item in its source respository</a>",,,,,,,,,,,,,,,,,,,,,,,,,,,,,http://www.iowaheritage.org/files/original/1ef3eb4d5484225114f0d5cb45223cb5.jpg,"Remote Item","Des Moines University Historic Photograph Collection",1,0
2685,http://www.iowaheritage.org/items/show/2685,"37th Street, Gardner Cowles Residence|Residence of Gardner Cowles","Houses|Trees|Bicycles & tricycles","This house on 37th Street was built in 1909 and is still standing. It was the home of Gardner Cowles and his wife Florence. Mr. Cowles was a banker, publisher and politician. He served two terms as a member of the Iowa House of Representatives. In 1903 Mr. Cowles purchased the Register and Leader Company, starting his family's publishing and media empire. Drake University conferred upon Mr. Cowles the honorary degree of Doctor of Laws. In 1937 the Gardner Cowles Foundation donated funds for Cowles Library, Drake's main library. Mr. Cowles passed away in 1946.",,"Special Collections, Cowles Library -- Drake University.","Chicago, Il. : Gravure Illustration Co.",1914|2005/04/25,,"U.S. and International copyright laws protect this digital image. Commercial use or distribution of the image is not permitted without prior permission of the copyright holder. For permission to use the digital image, please contact: bart.schmidt@drake.edu","Art Work of Des Moines -- Book One","Photographic print, 4.5 x 7 in.",,Image,"v. 1, p. 3|dm0004|http://ddr.lib.drake.edu/u?/du-hdm,34","100 37th St.",,,,,,,,,,,,,,,,,,,,,,,,,,,,,,,,,,,,,,,,,,,,,,,"<a href=""http://ddr.lib.drake.edu/u?/du-hdm,34"" target=""_blank"">View this item in its source respository</a>",,,,,,,,,,,,,,,,,,,,,,,,,,,,,http://www.iowaheritage.org/files/original/522f928437c61e6078087f76fdfb855b.jpg,"Remote Item","Des Moines University Historic Photograph Collection",1,0
68407,http://www.iowaheritage.org/items/show/68407,"Women inside tree, Iowa City, Iowa, 1910s","Women|Trees|United States -- Iowa -- Iowa City|1910-1920",,unknown,,"University of Iowa. Libraries. Iowa Women's Archives",1910/1919|2007-06-28,,"No known copyright restrictions.","Noble Photographs|Noble Photograph collection|http://www.lib.uiowa.edu/collguides/?IWA0031",9|14,,"Still image; Text|Photographic postcards|jpeg",IWA0031|160192410|http://digital.lib.uiowa.edu/cdm/ref/collection/noble/id/972,,,,,,,,,,,,,,,,,,,,,,,,,,,,,,,,,,,,,,,,,,,,,,,,"<a href=""http://digital.lib.uiowa.edu/cdm/ref/collection/noble/id/972"" target=""_blank"">View this item in its source respository</a>",,,,,,,,,,,,,,,,,,,,,,,,,,,,,http://www.iowaheritage.org/files/original/b44bf9adf6bec28c3dfd99eb9ad60284.jpg,"Remote Item","Mary Noble Historical Photograph Collection",1,0
