 




﻿"Item Id","Item URI","Dublin Core:Title","Dublin Core:Subject","Dublin Core:Description","Dublin Core:Creator","Dublin Core:Source","Dublin Core:Publisher","Dublin Core:Date","Dublin Core:Contributor","Dublin Core:Rights","Dublin Core:Relation","Dublin Core:Format","Dublin Core:Language","Dublin Core:Type","Dublin Core:Identifier","Dublin Core:Coverage","Item Type Metadata:Text","Item Type Metadata:Interviewer","Item Type Metadata:Interviewee","Item Type Metadata:Location","Item Type Metadata:Transcription","Item Type Metadata:Local URL","Item Type Metadata:Original Format","Item Type Metadata:Physical Dimensions","Item Type Metadata:Duration","Item Type Metadata:Compression","Item Type Metadata:Producer","Item Type Metadata:Director","Item Type Metadata:Bit Rate/Frequency","Item Type Metadata:Time Summary","Item Type Metadata:Email Body","Item Type Metadata:Subject Line","Item Type Metadata:From","Item Type Metadata:To","Item Type Metadata:CC","Item Type Metadata:BCC","Item Type Metadata:Number of Attachments","Item Type Metadata:Standards","Item Type Metadata:Objectives","Item Type Metadata:Materials","Item Type Metadata:Lesson Plan Text","Item Type Metadata:URL","Item Type Metadata:Event Type","Item Type Metadata:Participants","Item Type Metadata:Birth Date","Item Type Metadata:Birthplace","Item Type Metadata:Death Date","Item Type Metadata:Occupation","Item Type Metadata:Biographical Text","Item Type Metadata:Bibliography","Item Type Metadata:Digital Reproduction Information","Item Type Metadata:Repository","Item Type Metadata:Repository Collection","Item Type Metadata:Contact information.","Item Type Metadata:File Name","Item Type Metadata:Notes","Item Type Metadata:Digital item created","Item Type Metadata:Digital item modified","Item Type Metadata:Executive Orders","Item Type Metadata:Record Created","Item Type Metadata:Record Modified","Item Type Metadata:Transcription2","Item Type Metadata:Source URL","Omeka Legacy File:Additional Creator","Omeka Legacy File:Transcriber","Omeka Legacy File:Producer","Omeka Legacy File:Render Device","Omeka Legacy File:Render Details","Omeka Legacy File:Capture Date","Omeka Legacy File:Capture Device","Omeka Legacy File:Capture Details","Omeka Legacy File:Change History","Omeka Legacy File:Watermark","Omeka Legacy File:Encryption","Omeka Legacy File:Compression","Omeka Legacy File:Post Processing","Omeka Image File:Width","Omeka Image File:Height","Omeka Image File:Bit Depth","Omeka Image File:Channels","Omeka Image File:Exif String","Omeka Image File:Exif Array","Omeka Image File:IPTC String","Omeka Image File:IPTC Array","Omeka Video File:Bitrate","Omeka Video File:Duration","Omeka Video File:Sample Rate","Omeka Video File:Codec","Omeka Video File:Width","Omeka Video File:Height",tags,file,itemType,collection,public,featured
64540,http://www.iowaheritage.org/items/show/64540,"Ventriloquist Ronald Reagan","Presidents|Reagan, Ronald|United States|Presidents|1980-1990|Presidents -- United States|Presidential power|Presidential appointees|Press|Men|Ventriloquism|Dummies|Comedians|Stools|Eggs|Eggshells|Chickens|Bottles|Eyeglasses|Puppets",,"Duffy, Brian, 1955-",,"University of Iowa. Libraries. Special Collections Dept.",1985-03-03|2011-04,,"Educational use only, no other permissions given. Copyright to this digital object is owned by The Des Moines Register; it may not be downloaded, reproduced, or distributed without written permission. For more information, contact the Special Collections Department.","Editorial Cartoons of Brian Duffy; Des Moines Register Cartoonists|Papers of Brian Duffy|Des Moines Register",,English,"Still image|Editorial cartoons",MSC916|duffy-850303|http://digital.lib.uiowa.edu/cdm/ref/collection/duffy/id/378,,,,,,,,,,,,,,,,,,,,,,,,,,,,,,,,,,,,,,,,,,,,,,,,"<a href=""http://digital.lib.uiowa.edu/cdm/ref/collection/duffy/id/378"" target=""_blank"">View this item in its source respository</a>",,,,,,,,,,,,,,,,,,,,,,,,,,,,,http://www.iowaheritage.org/files/original/4408a022dd840bb26167a6c538dd0cc2.jpg,"Remote Item","Editorial Cartoons of Brian Duffy",1,0
17594,http://www.iowaheritage.org/items/show/17594,"Vice president Henry A. Wallace being greeted by President Alfonso Lopez, Colombia, 1943","Presidents|Wallace, Henry A. (Henry Agard), 1888-1965|Colombia|1940-1950|Vice presidents|Shaking hands|Lopez, Alfonso, 1886-1959",,unidentified,,"University of Iowa. Libraries. Special Collections Dept.",1943|2010-02-01,,"Educational use only, no other permissions given. U.S. and international copyright laws may protect this item. Commercial use or distribution of this digital object is not permitted without written permission of the University of Iowa Special Collections Dept.","Henry A. Wallace Collection|Henry Agard Wallace papers|http://lib.uiowa.edu/collguides/?MSC0177|Photographs & images|South American Goodwill Tour (March 16 - April 25, 1943), Colombia|Scanned with Ricoh 3228C scanner at 300 ppi. Archival tiff available.",jpeg,,"Still image|Photographs",MSC0177|7|1|wal-051.jpg|https://digital.lib.uiowa.edu/,,,,,,,,,,,,,,,,,,,,,,,,,,,,,,,,,,,,,,,,,,,,,,,,"<a href=""https://digital.lib.uiowa.edu/"" target=""_blank"">View this item in its source respository</a>",,,,,,,,,,,,,,,,,,,,,,,,,,,,,http://www.iowaheritage.org/files/original/e93535fe937554771f63ac1b3f69d427.jpg,"Remote Item","Henry A. Wallace Collection",1,0
17598,http://www.iowaheritage.org/items/show/17598,"Vice president Henry A. Wallace in conversation with President Rafael Angel Calderon Guardia at the San Jose airport, Costa Rica, 1943","Presidents|Wallace, Henry A. (Henry Agard), 1888-1965|Costa Rica -- San Jose|1940-1950|Vice presidents|Salutations|Calderon Guardia, Rafael Angel, 1900-1970",,unidentified,,"University of Iowa. Libraries. Special Collections Dept.",1943|2010-02-01,,"Educational use only, no other permissions given. U.S. and international copyright laws may protect this item. Commercial use or distribution of this digital object is not permitted without written permission of the University of Iowa Special Collections Dept.","Henry A. Wallace Collection|Henry Agard Wallace papers|http://lib.uiowa.edu/collguides/?MSC0177|Photographs & images|South American Goodwill Tour (March 16 - April 25, 1943), Costa Rica|Scanned with Ricoh 3228C scanner at 300 ppi. Archival tiff available.",jpeg,,"Still image|Photographs",MSC0177|7|1|wal-049.jpg|https://digital.lib.uiowa.edu/,,,,,,,,,,,,,,,,,,,,,,,,,,,,,,,,,,,,,,,,,,,,,,,,"<a href=""https://digital.lib.uiowa.edu/"" target=""_blank"">View this item in its source respository</a>",,,,,,,,,,,,,,,,,,,,,,,,,,,,,http://www.iowaheritage.org/files/original/83d5fc2f14457fc7972a44c158ce957c.jpg,"Remote Item","Henry A. Wallace Collection",1,0
17596,http://www.iowaheritage.org/items/show/17596,"Vice president Henry A. Wallace with President Alfonso Lopez, Colombian cabinet members, and other officials, Colombia, 1943","Vice presidents|Wallace, Henry A. (Henry Agard), 1888-1965|Colombia|1940-1950|Presidents|Cabinet officers|Government officials|Lopez, Alfonso, 1886-1959",,unidentified,,"University of Iowa. Libraries. Special Collections Dept.",1943|2010-02-01,,"Educational use only, no other permissions given. U.S. and international copyright laws may protect this item. Commercial use or distribution of this digital object is not permitted without written permission of the University of Iowa Special Collections Dept.","Henry A. Wallace Collection|Henry Agard Wallace papers|http://lib.uiowa.edu/collguides/?MSC0177|Photographs & images|South American Goodwill Tour (March 16 - April 25, 1943), Colombia|Scanned with Ricoh 3228C scanner at 300 ppi. Archival tiff available.",jpeg,,"Still image|Photographs; Group portraits",MSC0177|7|4|wal-050.jpg|https://digital.lib.uiowa.edu/,,,,,,,,,,,,,,,,,,,,,,,,,,,,,,,,,,,,,,,,,,,,,,,,"<a href=""https://digital.lib.uiowa.edu/"" target=""_blank"">View this item in its source respository</a>",,,,,,,,,,,,,,,,,,,,,,,,,,,,,http://www.iowaheritage.org/files/original/ee8bc90d99e9d07af8614704dcb04f7c.jpg,"Remote Item","Henry A. Wallace Collection",1,0
20458,http://www.iowaheritage.org/items/show/20458,"Vice president Henry A. Wallace with President Franklin Roosevelt in front of radio microphones, United States, 1940s","Presidents|Wallace, Henry A. (Henry Agard), 1888-1965|United States|1940-1950|Roosevelt, Franklin D. (Franklin Delano), 1882-1945|Vice presidents|Microphones|Radio broadcasting",,unidentified,,"University of Iowa. Libraries. Special Collections Dept.",1940/1949|2010-02-01,,"Educational use only, no other permissions given. U.S. and international copyright laws may protect this item. Commercial use or distribution of this digital object is not permitted without written permission of the University of Iowa Special Collections Dept.","Henry A. Wallace Collection|Henry Agard Wallace papers|http://lib.uiowa.edu/collguides/?MSC0177|Photographs & images|Miscellaneous|Scanned with Ricoh 3228C scanner at 300 ppi. Archival tiff available.",jpeg,,"Still image|Photographs",MSC0177|7|15|wal-044.jpg|https://digital.lib.uiowa.edu/,,,,,,,,,,,,,,,,,,,,,,,,,,,,,,,,,,,,,,,,,,,,,,,,"<a href=""https://digital.lib.uiowa.edu/"" target=""_blank"">View this item in its source respository</a>",,,,,,,,,,,,,,,,,,,,,,,,,,,,,http://www.iowaheritage.org/files/original/2f94d5621a5b0eb9730412e74327bae4.jpg,"Remote Item","Henry A. Wallace Collection",1,1
64670,http://www.iowaheritage.org/items/show/64670,VOTE,"Voters|Clinton, Bill, 1946-|United States|Presidents -- United States -- Election -- 1992|Candidates|1990-2000|Votes|Voting|Elections|Elections -- United States|Presidents|Candidates|Bush, George, 1924-|Perot, H. Ross, 1930-|Presidents|Signs|Congressmen",Congress,"Duffy, Brian, 1955-",,"University of Iowa. Libraries. Special Collections Dept.",1992-11-03|2011-04,,"Educational use only, no other permissions given. Copyright to this digital object is owned by The Des Moines Register; it may not be downloaded, reproduced, or distributed without written permission. For more information, contact the Special Collections Department.","Editorial Cartoons of Brian Duffy; Des Moines Register Cartoonists|Papers of Brian Duffy|Des Moines Register",,English,"Still image|Editorial cartoons",MSC916|duffy-921103|http://digital.lib.uiowa.edu/cdm/ref/collection/duffy/id/508,,,,,,,,,,,,,,,,,,,,,,,,,,,,,,,,,,,,,,,,,,,,,,,,"<a href=""http://digital.lib.uiowa.edu/cdm/ref/collection/duffy/id/508"" target=""_blank"">View this item in its source respository</a>",,,,,,,,,,,,,,,,,,,,,,,,,,,,,http://www.iowaheritage.org/files/original/b938afe3edb65a830358bebc0958f74b.jpg,"Remote Item","Editorial Cartoons of Brian Duffy",1,0
64411,http://www.iowaheritage.org/items/show/64411,"War powers","Presidents|Bush, George, 1924-|United States|Presidents|1990-2000|Presidents -- United States|War|Wars|Aggression|Aggression (International law)|Congress|Power|Politicians|Politics|Men|Arrows|Eagles|Ruts",Congress,"Duffy, Brian, 1955-",,"University of Iowa. Libraries. Special Collections Dept.",1991-01-08|2011-04,,"Educational use only, no other permissions given. Copyright to this digital object is owned by The Des Moines Register; it may not be downloaded, reproduced, or distributed without written permission. For more information, contact the Special Collections Department.","Editorial Cartoons of Brian Duffy; Des Moines Register Cartoonists|Papers of Brian Duffy|Des Moines Register",,English,"Still image|Editorial cartoons",MSC916|duffy-910108|http://digital.lib.uiowa.edu/cdm/ref/collection/duffy/id/249,,,,,,,,,,,,,,,,,,,,,,,,,,,,,,,,,,,,,,,,,,,,,,,,"<a href=""http://digital.lib.uiowa.edu/cdm/ref/collection/duffy/id/249"" target=""_blank"">View this item in its source respository</a>",,,,,,,,,,,,,,,,,,,,,,,,,,,,,http://www.iowaheritage.org/files/original/672b201b00b6814fcf9d806cc4860ca3.jpg,"Remote Item","Editorial Cartoons of Brian Duffy",1,0
64699,http://www.iowaheritage.org/items/show/64699,"We're probably going to have to come back this way afterwards","Presidency|Clinton, Bill, 1946|United States|Cemeteries|1990-2000|Presidents -- United States|Presidents' spouses--United States|Scandal|Ethics|Elections|Elections -- United States|Clinton, Hillary Rodham|Graves|Graveyards|Trees|Presidents|Wives|Moon|Signs|Hands","Whitewater; FBI files; Campaign funds; Election","Duffy, Brian, 1955-",,"University of Iowa. Libraries. Special Collections Dept.",1996-10-31|2011-04,,"Educational use only, no other permissions given. Copyright to this digital object is owned by The Des Moines Register; it may not be downloaded, reproduced, or distributed without written permission. For more information, contact the Special Collections Department.","Editorial Cartoons of Brian Duffy; Des Moines Register Cartoonists|Papers of Brian Duffy|Des Moines Register",,English,"Still image|Editorial cartoons",MSC916|duffy-961031|http://digital.lib.uiowa.edu/cdm/ref/collection/duffy/id/537,,,,,,,,,,,,,,,,,,,,,,,,,,,,,,,,,,,,,,,,,,,,,,,,"<a href=""http://digital.lib.uiowa.edu/cdm/ref/collection/duffy/id/537"" target=""_blank"">View this item in its source respository</a>",,,,,,,,,,,,,,,,,,,,,,,,,,,,,http://www.iowaheritage.org/files/original/26fecd6d34ef80b5435f9f765a2f5571.jpg,"Remote Item","Editorial Cartoons of Brian Duffy",1,0
64352,http://www.iowaheritage.org/items/show/64352,"We're right behind you old boy!","Presidents|Reagan, Ronald|United States|Presidents|1980-1990|Dictatorships|Economic sanctions|United States -- Foreign relations|United States -- Foreign economic relations|United States -- Foreign relations -- Libya|Great Britain|Western Europe|Germany|France|Libya|Leaders|Guns|Men|Caves|Skulls|Hunters|Hunting","Ja!; Oui!; Western Europe; Libya; Sanctions","Duffy, Brian, 1955-",,"University of Iowa. Libraries. Special Collections Dept.",1986-01-05|2011-04,,"Educational use only, no other permissions given. Copyright to this digital object is owned by The Des Moines Register; it may not be downloaded, reproduced, or distributed without written permission. For more information, contact the Special Collections Department.","Editorial Cartoons of Brian Duffy; Des Moines Register Cartoonists|Papers of Brian Duffy|Des Moines Register",,English,"Still image|Editorial cartoons",MSC916|duffy-860105|http://digital.lib.uiowa.edu/cdm/ref/collection/duffy/id/190,,,,,,,,,,,,,,,,,,,,,,,,,,,,,,,,,,,,,,,,,,,,,,,,"<a href=""http://digital.lib.uiowa.edu/cdm/ref/collection/duffy/id/190"" target=""_blank"">View this item in its source respository</a>",,,,,,,,,,,,,,,,,,,,,,,,,,,,,http://www.iowaheritage.org/files/original/53c9659ea35e79444b01c696355b3086.jpg,"Remote Item","Editorial Cartoons of Brian Duffy",1,0
64636,http://www.iowaheritage.org/items/show/64636,"We're stuck, and it's all your fault!","Christmas|Bush, George, 1924-|United States|Presidents|1990-2000|Presidents -- United States|Congress|Economy|Economic conditions|Recession|Men|Santa Claus|Bags|Roofs|Chimneys|Snow|Windows|Children|Fireplaces|Christmas trees|Christmas stockings|Firewood|Candles|Wreaths","Gimme the matches; It's your fault!; ... is not!; ... is too!; Congress; Economy","Duffy, Brian, 1955-",,"University of Iowa. Libraries. Special Collections Dept.",1991-12-13|2011-04,,"Educational use only, no other permissions given. Copyright to this digital object is owned by The Des Moines Register; it may not be downloaded, reproduced, or distributed without written permission. For more information, contact the Special Collections Department.","Editorial Cartoons of Brian Duffy; Des Moines Register Cartoonists|Papers of Brian Duffy|Des Moines Register",,English,"Still image|Editorial cartoons",MSC916|duffy-911213|http://digital.lib.uiowa.edu/cdm/ref/collection/duffy/id/474,,,,,,,,,,,,,,,,,,,,,,,,,,,,,,,,,,,,,,,,,,,,,,,,"<a href=""http://digital.lib.uiowa.edu/cdm/ref/collection/duffy/id/474"" target=""_blank"">View this item in its source respository</a>",,,,,,,,,,,,,,,,,,,,,,,,,,,,,http://www.iowaheritage.org/files/original/91c3a793644f2158c21bf78ff2f3475d.jpg,"Remote Item","Editorial Cartoons of Brian Duffy",1,0
