 




﻿"Item Id","Item URI","Dublin Core:Title","Dublin Core:Subject","Dublin Core:Description","Dublin Core:Creator","Dublin Core:Source","Dublin Core:Publisher","Dublin Core:Date","Dublin Core:Contributor","Dublin Core:Rights","Dublin Core:Relation","Dublin Core:Format","Dublin Core:Language","Dublin Core:Type","Dublin Core:Identifier","Dublin Core:Coverage","Item Type Metadata:Text","Item Type Metadata:Interviewer","Item Type Metadata:Interviewee","Item Type Metadata:Location","Item Type Metadata:Transcription","Item Type Metadata:Local URL","Item Type Metadata:Original Format","Item Type Metadata:Physical Dimensions","Item Type Metadata:Duration","Item Type Metadata:Compression","Item Type Metadata:Producer","Item Type Metadata:Director","Item Type Metadata:Bit Rate/Frequency","Item Type Metadata:Time Summary","Item Type Metadata:Email Body","Item Type Metadata:Subject Line","Item Type Metadata:From","Item Type Metadata:To","Item Type Metadata:CC","Item Type Metadata:BCC","Item Type Metadata:Number of Attachments","Item Type Metadata:Standards","Item Type Metadata:Objectives","Item Type Metadata:Materials","Item Type Metadata:Lesson Plan Text","Item Type Metadata:URL","Item Type Metadata:Event Type","Item Type Metadata:Participants","Item Type Metadata:Birth Date","Item Type Metadata:Birthplace","Item Type Metadata:Death Date","Item Type Metadata:Occupation","Item Type Metadata:Biographical Text","Item Type Metadata:Bibliography","Item Type Metadata:Digital Reproduction Information","Item Type Metadata:Repository","Item Type Metadata:Repository Collection","Item Type Metadata:Contact information.","Item Type Metadata:File Name","Item Type Metadata:Notes","Item Type Metadata:Digital item created","Item Type Metadata:Digital item modified","Item Type Metadata:Executive Orders","Item Type Metadata:Record Created","Item Type Metadata:Record Modified","Item Type Metadata:Transcription2","Item Type Metadata:Source URL","Omeka Legacy File:Additional Creator","Omeka Legacy File:Transcriber","Omeka Legacy File:Producer","Omeka Legacy File:Render Device","Omeka Legacy File:Render Details","Omeka Legacy File:Capture Date","Omeka Legacy File:Capture Device","Omeka Legacy File:Capture Details","Omeka Legacy File:Change History","Omeka Legacy File:Watermark","Omeka Legacy File:Encryption","Omeka Legacy File:Compression","Omeka Legacy File:Post Processing","Omeka Image File:Width","Omeka Image File:Height","Omeka Image File:Bit Depth","Omeka Image File:Channels","Omeka Image File:Exif String","Omeka Image File:Exif Array","Omeka Image File:IPTC String","Omeka Image File:IPTC Array","Omeka Video File:Bitrate","Omeka Video File:Duration","Omeka Video File:Sample Rate","Omeka Video File:Codec","Omeka Video File:Width","Omeka Video File:Height",tags,file,itemType,collection,public,featured
3357,http://www.iowaheritage.org/items/show/3357,"Hurrying to the rescue.","Military policy|Stone, William Joel, 1848-1918|World War, 1914-1918|Boat|Congress|War|anchor.",,"Darling, Jay N. (Jay Norwood), 1876-1962","The Editorial cartoons of J.N. ""Ding"" Darling [electronic resource] : The Cowles Collection, Drake University, 1912-1962",,1917/05/25|1917,,"Copyright is owned by the ""Ding"" Darling Wildlife Society; it is administered on behalf of the Society by The University of Iowa. While use within the classroom is encouraged without specific authorization, publishing this cartoon in any format requires written permission. See policy and permissions procedure at: http://www.lib.uiowa.edu/spec-coll/services/dingdarling_fees.html","Cowles Library, Drake University, 2507 University Ave., Des Moines, IA 50311-4505.",,,,"170525.jpg|http://ddr.lib.drake.edu/u?/ddarling,486",,,,,,,,,,,,,,,,,,,,,,,,,,,,,,,,,,,,,,,,,,,,,,,,"<a href=""http://ddr.lib.drake.edu/u?/ddarling,486"" target=""_blank"">View this item in its source respository</a>",,,,,,,,,,,,,,,,,,,,,,,,,,,,,http://www.iowaheritage.org/files/original/22a6380ab2cf6842ec8ec3e9a17f583c.jpg,"Remote Item","Editorial Cartoons of J.N. ""Ding"" Darling, Drake University",1,0
64433,http://www.iowaheritage.org/items/show/64433,"I don't like the way he's looking at me","Treasuries|Brady, Nicholas F.|Washington (D.C.)|Pigs|1990-2000|Congress|Congressional Appropriations|Banking|Banks|Greed|Men|Congressmen|Leashes","Congress; Banking overhaul proposals; Treasury sec. Brady","Duffy, Brian, 1955-",,"University of Iowa. Libraries. Special Collections Dept.",1991-02-09|2011-04,,"Educational use only, no other permissions given. Copyright to this digital object is owned by The Des Moines Register; it may not be downloaded, reproduced, or distributed without written permission. For more information, contact the Special Collections Department.","Editorial Cartoons of Brian Duffy; Des Moines Register Cartoonists|Papers of Brian Duffy|Des Moines Register",,English,"Still image|Editorial cartoons",MSC916|duffy-910209|http://digital.lib.uiowa.edu/cdm/ref/collection/duffy/id/271,,,,,,,,,,,,,,,,,,,,,,,,,,,,,,,,,,,,,,,,,,,,,,,,"<a href=""http://digital.lib.uiowa.edu/cdm/ref/collection/duffy/id/271"" target=""_blank"">View this item in its source respository</a>",,,,,,,,,,,,,,,,,,,,,,,,,,,,,http://www.iowaheritage.org/files/original/56c2815f1f11d648edcb591d6a04e7a3.jpg,"Remote Item","Editorial Cartoons of Brian Duffy",1,0
64206,http://www.iowaheritage.org/items/show/64206,"I think I can","Congress|United States|Trains|2000-2010|Congressional spending|Budgets|Budgets -- United States|Trains|Travel|Travelers|Transportation|Transportation -- Rates|Engineers|Signs|People|Smoke","Ridership increases; Steep grade ahead; Amtrak; Fat chance, unless Congress comes through with some more cash","Duffy, Brian, 1955-",,"University of Iowa. Libraries. Special Collections Dept.",2001-09-26|2011-04,,"Educational use only, no other permissions given. Copyright to this digital object is owned by The Des Moines Register; it may not be downloaded, reproduced, or distributed without written permission. For more information, contact the Special Collections Department.","Editorial Cartoons of Brian Duffy; Des Moines Register Cartoonists|Papers of Brian Duffy|Des Moines Register",,English,"Still image|Editorial cartoons",MSC916|duffy-010926|http://digital.lib.uiowa.edu/cdm/ref/collection/duffy/id/44,,,,,,,,,,,,,,,,,,,,,,,,,,,,,,,,,,,,,,,,,,,,,,,,"<a href=""http://digital.lib.uiowa.edu/cdm/ref/collection/duffy/id/44"" target=""_blank"">View this item in its source respository</a>",,,,,,,,,,,,,,,,,,,,,,,,,,,,,http://www.iowaheritage.org/files/original/8ffa41c4f7dc495e941ff9ea26c2fbeb.jpg,"Remote Item","Editorial Cartoons of Brian Duffy",1,0
64468,http://www.iowaheritage.org/items/show/64468,"I was surfing the Internet and I landed on this nude beach","Computers|United States|Children|1990-2000|Regulation|Pornography|Congress|Parenthood|Families|Family life|Boys|Women|Mothers|Computers|Newspapers|Desks|Chairs","?; News; Senate goes after computer porn","Duffy, Brian, 1955-",,"University of Iowa. Libraries. Special Collections Dept.",1995-04-02|2011-04,,"Educational use only, no other permissions given. Copyright to this digital object is owned by The Des Moines Register; it may not be downloaded, reproduced, or distributed without written permission. For more information, contact the Special Collections Department.","Editorial Cartoons of Brian Duffy; Des Moines Register Cartoonists|Papers of Brian Duffy|Des Moines Register",,English,"Still image|Editorial cartoons",MSC916|duffy-950402|http://digital.lib.uiowa.edu/cdm/ref/collection/duffy/id/306,,,,,,,,,,,,,,,,,,,,,,,,,,,,,,,,,,,,,,,,,,,,,,,,"<a href=""http://digital.lib.uiowa.edu/cdm/ref/collection/duffy/id/306"" target=""_blank"">View this item in its source respository</a>",,,,,,,,,,,,,,,,,,,,,,,,,,,,,http://www.iowaheritage.org/files/original/0809c8c2f8a49c18f1c00eb3edec8974.jpg,"Remote Item","Editorial Cartoons of Brian Duffy",1,0
64572,http://www.iowaheritage.org/items/show/64572,"I.O.U. Congress","Congress|United States|Babies|1980-1990|Congressional spending|Social Security|IOUs|Piggy banks|Hammers|Money|Men","Social Security trust fund; $","Duffy, Brian, 1955-",,"University of Iowa. Libraries. Special Collections Dept.",1989-05-03|2011-04,,"Educational use only, no other permissions given. Copyright to this digital object is owned by The Des Moines Register; it may not be downloaded, reproduced, or distributed without written permission. For more information, contact the Special Collections Department.","Editorial Cartoons of Brian Duffy; Des Moines Register Cartoonists|Papers of Brian Duffy|Des Moines Register",,English,"Still image|Editorial cartoons",MSC916|duffy-890503|http://digital.lib.uiowa.edu/cdm/ref/collection/duffy/id/410,,,,,,,,,,,,,,,,,,,,,,,,,,,,,,,,,,,,,,,,,,,,,,,,"<a href=""http://digital.lib.uiowa.edu/cdm/ref/collection/duffy/id/410"" target=""_blank"">View this item in its source respository</a>",,,,,,,,,,,,,,,,,,,,,,,,,,,,,http://www.iowaheritage.org/files/original/a3f6c13107d84d054742dc4115acdb8a.jpg,"Remote Item","Editorial Cartoons of Brian Duffy",1,0
6542,http://www.iowaheritage.org/items/show/6542,"If Congress really wants to investigate something.","Government|Magnifying glass|politics|U.S. mail|post office|postal department|Congress|investigations|franks|franking.|mail.",,"Darling, Jay N. (Jay Norwood), 1876-1962","The Editorial cartoons of J.N. ""Ding"" Darling [electronic resource] : The Cowles Collection, Drake University, 1912-1962",,1928/12/05|1928,,"Copyright is owned by the ""Ding"" Darling Wildlife Society; it is administered on behalf of the Society by The University of Iowa. While use within the classroom is encouraged without specific authorization, publishing this cartoon in any format requires written permission. See policy and permissions procedure at: http://www.lib.uiowa.edu/spec-coll/services/dingdarling_fees.html","Cowles Library, Drake University, 2507 University Ave., Des Moines, IA 50311-4505.",,,,"281205.jpg|http://ddr.lib.drake.edu/u?/ddarling,3630",,,,,,,,,,,,,,,,,,,,,,,,,,,,,,,,,,,,,,,,,,,,,,,,"<a href=""http://ddr.lib.drake.edu/u?/ddarling,3630"" target=""_blank"">View this item in its source respository</a>",,,,,,,,,,,,,,,,,,,,,,,,,,,,,http://www.iowaheritage.org/files/original/fcca710c7279a6e53dfce471e64a113d.jpg,"Remote Item","Editorial Cartoons of J.N. ""Ding"" Darling, Drake University",1,0
5453,http://www.iowaheritage.org/items/show/5453,"If Congress should investigate the rest of us.","Government|Ordinary citizen.|Congress|scandal|censure|human nature",,"Darling, Jay N. (Jay Norwood), 1876-1962","The Editorial cartoons of J.N. ""Ding"" Darling [electronic resource] : The Cowles Collection, Drake University, 1912-1962",,1924/03/24|1924,,"Copyright is owned by the ""Ding"" Darling Wildlife Society; it is administered on behalf of the Society by The University of Iowa. While use within the classroom is encouraged without specific authorization, publishing this cartoon in any format requires written permission. See policy and permissions procedure at: http://www.lib.uiowa.edu/spec-coll/services/dingdarling_fees.html","Cowles Library, Drake University, 2507 University Ave., Des Moines, IA 50311-4505.",,,,"240324.jpg|http://ddr.lib.drake.edu/u?/ddarling,2582",,,,,,,,,,,,,,,,,,,,,,,,,,,,,,,,,,,,,,,,,,,,,,,,"<a href=""http://ddr.lib.drake.edu/u?/ddarling,2582"" target=""_blank"">View this item in its source respository</a>",,,,,,,,,,,,,,,,,,,,,,,,,,,,,http://www.iowaheritage.org/files/original/0595e9e31f112521f64cb182dfd71198.jpg,"Remote Item","Editorial Cartoons of J.N. ""Ding"" Darling, Drake University",1,0
7457,http://www.iowaheritage.org/items/show/7457,"If he'd cut it when he should it would be all done by this time.","Government|Hoover, Herbert, 1874-1964|Elections 1932|Lawnmower|politics|waste|taxes|taxation|elections|Congress|Presidency|Congress.",,"Darling, Jay N. (Jay Norwood), 1876-1962","The Editorial cartoons of J.N. ""Ding"" Darling [electronic resource] : The Cowles Collection, Drake University, 1912-1962",,1932/05/13|1932,,"Copyright is owned by the ""Ding"" Darling Wildlife Society; it is administered on behalf of the Society by The University of Iowa. While use within the classroom is encouraged without specific authorization, publishing this cartoon in any format requires written permission. See policy and permissions procedure at: http://www.lib.uiowa.edu/spec-coll/services/dingdarling_fees.html","Cowles Library, Drake University, 2507 University Ave., Des Moines, IA 50311-4505.",,,,"320513.jpg|http://ddr.lib.drake.edu/u?/ddarling,4386",,,,,,,,,,,,,,,,,,,,,,,,,,,,,,,,,,,,,,,,,,,,,,,,"<a href=""http://ddr.lib.drake.edu/u?/ddarling,4386"" target=""_blank"">View this item in its source respository</a>",,,,,,,,,,,,,,,,,,,,,,,,,,,,,http://www.iowaheritage.org/files/original/de5e6557762139b2f9d57a0a81247ea9.jpg,"Remote Item","Editorial Cartoons of J.N. ""Ding"" Darling, Drake University",1,0
4978,http://www.iowaheritage.org/items/show/4978,"If it wasn't for that overcoat he certainly would feel the cold though.","Government|Harding, Warren G. (Warren Gamaliel), 1865-1923|Elections 1922|Congressmen.|politics|elections|Congress|budgets|taxes|spending",,"Darling, Jay N. (Jay Norwood), 1876-1962","The Editorial cartoons of J.N. ""Ding"" Darling [electronic resource] : The Cowles Collection, Drake University, 1912-1962",,1922/10/24|1922,,"Copyright is owned by the ""Ding"" Darling Wildlife Society; it is administered on behalf of the Society by The University of Iowa. While use within the classroom is encouraged without specific authorization, publishing this cartoon in any format requires written permission. See policy and permissions procedure at: http://www.lib.uiowa.edu/spec-coll/services/dingdarling_fees.html","Cowles Library, Drake University, 2507 University Ave., Des Moines, IA 50311-4505.",,,,"221024.jpg|http://ddr.lib.drake.edu/u?/ddarling,2107",,,,,,,,,,,,,,,,,,,,,,,,,,,,,,,,,,,,,,,,,,,,,,,,"<a href=""http://ddr.lib.drake.edu/u?/ddarling,2107"" target=""_blank"">View this item in its source respository</a>",,,,,,,,,,,,,,,,,,,,,,,,,,,,,http://www.iowaheritage.org/files/original/236de89aba7f246639df9490de4a37c3.jpg,"Remote Item","Editorial Cartoons of J.N. ""Ding"" Darling, Drake University",1,0
6613,http://www.iowaheritage.org/items/show/6613,"If only we could harness it we'd have had farm relief long ago.",Politics|Windmill|speeches|Congress|agriculture|farming|aid|supports|Congressman|farm.,,"Darling, Jay N. (Jay Norwood), 1876-1962","The Editorial cartoons of J.N. ""Ding"" Darling [electronic resource] : The Cowles Collection, Drake University, 1912-1962",,1929/04/19|1929,,"Copyright is owned by the ""Ding"" Darling Wildlife Society; it is administered on behalf of the Society by The University of Iowa. While use within the classroom is encouraged without specific authorization, publishing this cartoon in any format requires written permission. See policy and permissions procedure at: http://www.lib.uiowa.edu/spec-coll/services/dingdarling_fees.html","Cowles Library, Drake University, 2507 University Ave., Des Moines, IA 50311-4505.",,,,"290419.jpg|http://ddr.lib.drake.edu/u?/ddarling,3701",,,,,,,,,,,,,,,,,,,,,,,,,,,,,,,,,,,,,,,,,,,,,,,,"<a href=""http://ddr.lib.drake.edu/u?/ddarling,3701"" target=""_blank"">View this item in its source respository</a>",,,,,,,,,,,,,,,,,,,,,,,,,,,,,http://www.iowaheritage.org/files/original/eeb5729348243bc42150fda8afe8c6fc.jpg,"Remote Item","Editorial Cartoons of J.N. ""Ding"" Darling, Drake University",1,0
