 




﻿"Item Id","Item URI","Dublin Core:Title","Dublin Core:Subject","Dublin Core:Description","Dublin Core:Creator","Dublin Core:Source","Dublin Core:Publisher","Dublin Core:Date","Dublin Core:Contributor","Dublin Core:Rights","Dublin Core:Relation","Dublin Core:Format","Dublin Core:Language","Dublin Core:Type","Dublin Core:Identifier","Dublin Core:Coverage","Item Type Metadata:Text","Item Type Metadata:Interviewer","Item Type Metadata:Interviewee","Item Type Metadata:Location","Item Type Metadata:Transcription","Item Type Metadata:Local URL","Item Type Metadata:Original Format","Item Type Metadata:Physical Dimensions","Item Type Metadata:Duration","Item Type Metadata:Compression","Item Type Metadata:Producer","Item Type Metadata:Director","Item Type Metadata:Bit Rate/Frequency","Item Type Metadata:Time Summary","Item Type Metadata:Email Body","Item Type Metadata:Subject Line","Item Type Metadata:From","Item Type Metadata:To","Item Type Metadata:CC","Item Type Metadata:BCC","Item Type Metadata:Number of Attachments","Item Type Metadata:Standards","Item Type Metadata:Objectives","Item Type Metadata:Materials","Item Type Metadata:Lesson Plan Text","Item Type Metadata:URL","Item Type Metadata:Event Type","Item Type Metadata:Participants","Item Type Metadata:Birth Date","Item Type Metadata:Birthplace","Item Type Metadata:Death Date","Item Type Metadata:Occupation","Item Type Metadata:Biographical Text","Item Type Metadata:Bibliography","Item Type Metadata:Digital Reproduction Information","Item Type Metadata:Repository","Item Type Metadata:Repository Collection","Item Type Metadata:Contact information.","Item Type Metadata:File Name","Item Type Metadata:Notes","Item Type Metadata:Digital item created","Item Type Metadata:Digital item modified","Item Type Metadata:Executive Orders","Item Type Metadata:Record Created","Item Type Metadata:Record Modified","Item Type Metadata:Transcription2","Item Type Metadata:Source URL","Omeka Legacy File:Additional Creator","Omeka Legacy File:Transcriber","Omeka Legacy File:Producer","Omeka Legacy File:Render Device","Omeka Legacy File:Render Details","Omeka Legacy File:Capture Date","Omeka Legacy File:Capture Device","Omeka Legacy File:Capture Details","Omeka Legacy File:Change History","Omeka Legacy File:Watermark","Omeka Legacy File:Encryption","Omeka Legacy File:Compression","Omeka Legacy File:Post Processing","Omeka Image File:Width","Omeka Image File:Height","Omeka Image File:Bit Depth","Omeka Image File:Channels","Omeka Image File:Exif String","Omeka Image File:Exif Array","Omeka Image File:IPTC String","Omeka Image File:IPTC Array","Omeka Video File:Bitrate","Omeka Video File:Duration","Omeka Video File:Sample Rate","Omeka Video File:Codec","Omeka Video File:Width","Omeka Video File:Height",tags,file,itemType,collection,public,featured
109215,http://www.iowaheritage.org/items/show/109215,"Durward Family Group",People,"The Johnson-Lieferman photo collection was donated to the Clinton Public Library in 2011. All rights belong to the Clinton Public Library. This collection is stored at the Lyons Branch Library.","Johnson-Lieferman Photo Collection","Negatives, Original Photographs, with some digital content in our library archives.","Clinton Public Library",3-22-1947,,"No commercial reproduction or distribution of this file is permitted. If you had professional photos done by Johnson Photography or Lieferman Photography based out of Clinton, Iowa and would like to see if they are a part of this collection and could be purchased, please contact lyons@clintonpubliclibrary.us for a fee schedule and priority shipping. This includes scans of local businesses, places, and things, and historical photos that are labeled unknown.",,,,Image,8481,,,,,,,,,,,,,,,,,,,,,,,,,,,,,,,,,,,,,,,lyons@clintonpubliclibrary.us,,,,,,,,,,,,,,,,,,,,,,,,,,,,,,,,,,,,,"Child,Children,Couple,Family,History,Parent,Parents,People,Person,Siblings",http://www.iowaheritage.org/files/original/a8b1cf6ebb19602bea5d7ae9dcbf855a.tiff,"Still Image","Clinton Public Library Photo Collection. People. ",1,0
109213,http://www.iowaheritage.org/items/show/109213,"Donald Dunlavy|4 Months Old",People,"The Johnson-Lieferman photo collection was donated to the Clinton Public Library in 2011. All rights belong to the Clinton Public Library. This collection is stored at the Lyons Branch Library.","Johnson-Lieferman Photo Collection","Negatives, Original Photographs, with some digital content in our library archives.","Clinton Public Library",1-27-1947,,"No commercial reproduction or distribution of this file is permitted. If you had professional photos done by Johnson Photography or Lieferman Photography based out of Clinton, Iowa and would like to see if they are a part of this collection and could be purchased, please contact lyons@clintonpubliclibrary.us for a fee schedule and priority shipping. This includes scans of local businesses, places, and things, and historical photos that are labeled unknown.",,,,Image,8278,,,,,,,,,,,,,,,,,,,,,,,,,,,,,,,,,,,,,,,lyons@clintonpubliclibrary.us,,,,,,,,,,,,,,,,,,,,,,,,,,,,,,,,,,,,,"Baby,Child,History,Infant,People,Person,Toddler",http://www.iowaheritage.org/files/original/c3777e7b259d3aae52277e9a4c948f32.tiff,"Still Image","Clinton Public Library Photo Collection. People. ",1,0
109211,http://www.iowaheritage.org/items/show/109211,"Susan Dulany",People,"The Johnson-Lieferman photo collection was donated to the Clinton Public Library in 2011. All rights belong to the Clinton Public Library. This collection is stored at the Lyons Branch Library.","Johnson-Lieferman Photo Collection","Negatives, Original Photographs, with some digital content in our library archives.","Clinton Public Library",3-11-1947,,"No commercial reproduction or distribution of this file is permitted. If you had professional photos done by Johnson Photography or Lieferman Photography based out of Clinton, Iowa and would like to see if they are a part of this collection and could be purchased, please contact lyons@clintonpubliclibrary.us for a fee schedule and priority shipping. This includes scans of local businesses, places, and things, and historical photos that are labeled unknown.",,,,Image,8431,,,,,,,,,,,,,,,,,,,,,,,,,,,,,,,,,,,,,,,lyons@clintonpubliclibrary.us,,,,,,,,,,,,,,,,,,,,,,,,,,,,,,,,,,,,,"Adult,History,People,Person",http://www.iowaheritage.org/files/original/30a068c0bba145b37ad1b7c10de48e5e.tiff,"Still Image","Clinton Public Library Photo Collection. People. ",1,0
109210,http://www.iowaheritage.org/items/show/109210,"Sherry Ducker|11 Months Old",People,"The Johnson-Lieferman photo collection was donated to the Clinton Public Library in 2011. All rights belong to the Clinton Public Library. This collection is stored at the Lyons Branch Library.","Johnson-Lieferman Photo Collection","Negatives, Original Photographs, with some digital content in our library archives.","Clinton Public Library",2-8-1947,,"No commercial reproduction or distribution of this file is permitted. If you had professional photos done by Johnson Photography or Lieferman Photography based out of Clinton, Iowa and would like to see if they are a part of this collection and could be purchased, please contact lyons@clintonpubliclibrary.us for a fee schedule and priority shipping. This includes scans of local businesses, places, and things, and historical photos that are labeled unknown.",,,,Image,8338,,,,,,,,,,,,,,,,,,,,,,,,,,,,,,,,,,,,,,,lyons@clintonpubliclibrary.us,,,,,,,,,,,,,,,,,,,,,,,,,,,,,,,,,,,,,"Baby,Child,History,Infant,People,Person,Toddler",http://www.iowaheritage.org/files/original/3853dd03fc89c34d79c02ccc7ca61fc3.tiff,"Still Image","Clinton Public Library Photo Collection. People. ",1,0
109209,http://www.iowaheritage.org/items/show/109209,"Ronnie Droste|1 Year Old",People,"The Johnson-Lieferman photo collection was donated to the Clinton Public Library in 2011. All rights belong to the Clinton Public Library. This collection is stored at the Lyons Branch Library.","Johnson-Lieferman Photo Collection","Negatives, Original Photographs, with some digital content in our library archives.","Clinton Public Library",4-23-1947,,"No commercial reproduction or distribution of this file is permitted. If you had professional photos done by Johnson Photography or Lieferman Photography based out of Clinton, Iowa and would like to see if they are a part of this collection and could be purchased, please contact lyons@clintonpubliclibrary.us for a fee schedule and priority shipping. This includes scans of local businesses, places, and things, and historical photos that are labeled unknown.",,,,Image,8604,,,,,,,,,,,,,,,,,,,,,,,,,,,,,,,,,,,,,,,lyons@clintonpubliclibrary.us,,,,,,,,,,,,,,,,,,,,,,,,,,,,,,,,,,,,,"Child,History,Infant,People,Person,Toddler",http://www.iowaheritage.org/files/original/21a78c935bfc882b6ff1de5c4163d75a.tiff,"Still Image","Clinton Public Library Photo Collection. People. ",1,0
109208,http://www.iowaheritage.org/items/show/109208,"Geraldine Drolema",People,"The Johnson-Lieferman photo collection was donated to the Clinton Public Library in 2011. All rights belong to the Clinton Public Library. This collection is stored at the Lyons Branch Library.","Johnson-Lieferman Photo Collection","Negatives, Original Photographs, with some digital content in our library archives.","Clinton Public Library",1-28-1947,,"No commercial reproduction or distribution of this file is permitted. If you had professional photos done by Johnson Photography or Lieferman Photography based out of Clinton, Iowa and would like to see if they are a part of this collection and could be purchased, please contact lyons@clintonpubliclibrary.us for a fee schedule and priority shipping. This includes scans of local businesses, places, and things, and historical photos that are labeled unknown.",,,,Image,8285,,,,,,,,,,,,,,,,,,,,,,,,,,,,,,,,,,,,,,,lyons@clintonpubliclibrary.us,,,,,,,,,,,,,,,,,,,,,,,,,,,,,,,,,,,,,"Adult,History,People,Person",http://www.iowaheritage.org/files/original/37b2628afd0de65e677f2b5578c708b1.tiff,"Still Image","Clinton Public Library Photo Collection. People. ",1,0
109207,http://www.iowaheritage.org/items/show/109207,"Joel Driscoll|4 1/2 Months Old",People,"The Johnson-Lieferman photo collection was donated to the Clinton Public Library in 2011. All rights belong to the Clinton Public Library. This collection is stored at the Lyons Branch Library.","Johnson-Lieferman Photo Collection","Negatives, Original Photographs, with some digital content in our library archives.","Clinton Public Library",3-22-1947,,"No commercial reproduction or distribution of this file is permitted. If you had professional photos done by Johnson Photography or Lieferman Photography based out of Clinton, Iowa and would like to see if they are a part of this collection and could be purchased, please contact lyons@clintonpubliclibrary.us for a fee schedule and priority shipping. This includes scans of local businesses, places, and things, and historical photos that are labeled unknown.",,,,Image,8482,,,,,,,,,,,,,,,,,,,,,,,,,,,,,,,,,,,,,,,lyons@clintonpubliclibrary.us,,,,,,,,,,,,,,,,,,,,,,,,,,,,,,,,,,,,,"Baby,Child,History,Infant,People,Person,Toddler",http://www.iowaheritage.org/files/original/034c074ab03bed2f3738990d0c63b559.tiff,"Still Image","Clinton Public Library Photo Collection. People. ",1,0
109206,http://www.iowaheritage.org/items/show/109206,"Bonnie Doyle",People,"The Johnson-Lieferman photo collection was donated to the Clinton Public Library in 2011. All rights belong to the Clinton Public Library. This collection is stored at the Lyons Branch Library.","Johnson-Lieferman Photo Collection","Negatives, Original Photographs, with some digital content in our library archives.","Clinton Public Library",1947,,"No commercial reproduction or distribution of this file is permitted. If you had professional photos done by Johnson Photography or Lieferman Photography based out of Clinton, Iowa and would like to see if they are a part of this collection and could be purchased, please contact lyons@clintonpubliclibrary.us for a fee schedule and priority shipping. This includes scans of local businesses, places, and things, and historical photos that are labeled unknown.",,,,Image,8350,,,,,,,,,,,,,,,,,,,,,,,,,,,,,,,,,,,,,,,lyons@clintonpubliclibrary.us,,,,,,,,,,,,,,,,,,,,,,,,,,,,,,,,,,,,,"Child,History,People,Person",http://www.iowaheritage.org/files/original/43e7a5bc4b5775685345497f43e3e8f5.tiff,"Still Image","Clinton Public Library Photo Collection. People. ",1,0
109205,http://www.iowaheritage.org/items/show/109205,"Earth's Bounty in Iowa: Then and Now - Interview of Vivian Carter by Cathy Van Maanen at Huxley Public Library","Rural and Farm Life|Central Iowa","Rural and Farm Life","Vivian Carter|Cathy Van Maanen",,"State Library of Iowa",7/12/2023,,"This item is protected by copyright and/or related rights. You are free to use this Item in any way that is permitted by the copyright and related rights legislation that applies to your use. For other uses you need to obtain permission from the rights-holder(s).  <a href=""http://rightsstatements.org/"">http://rightsstatements.org</a>",,,,"Oral History",,"Visual transcript and oral history recording.",,"Cathy Van Maanen","Vivian Carter","Huxley Public Library",,,,,,,,,,,,,,,,,,,,,,,,,,,,,,,,,,,,,,,,,,,,,,,,,,,,,,,,,,,,,,,,,,,,,,,,"http://www.iowaheritage.org/files/original/14613780de7dd6bb0d55ed6613a13783.WAV,http://www.iowaheritage.org/files/original/8d2fa7ac3fbb663e79c97bce7dd64fc1.pdf","Oral History","Earth's Bounty in Iowa: Then and Now, Oral History Project",1,0
109204,http://www.iowaheritage.org/items/show/109204,"Earth's Bounty in Iowa: Then and Now - Interview of Margaret Nelson by Cathy Van Maanen at Huxley Public Library","Rural and Farm Life|Central Iowa","Rural and Farm Life","Margaret Nelson|Cathy Van Maanen",,"State Library of Iowa",7/7/2023,,"This item is protected by copyright and/or related rights. You are free to use this Item in any way that is permitted by the copyright and related rights legislation that applies to your use. For other uses you need to obtain permission from the rights-holder(s).  <a href=""http://rightsstatements.org/"">http://rightsstatements.org</a>",,,,,,,,"Cathy Van Maanen","Margaret Nelson","Huxley Public Library",,,,,,,,,,,,,,,,,,,,,,,,,,,,,,,,,,,,,,,,,,,,,,,,,,,,,,,,,,,,,,,,,,,,,,,,"http://www.iowaheritage.org/files/original/0dfad0b7616ae6127008bbc7b09b3987.WAV,http://www.iowaheritage.org/files/original/5bbce4aaa9b7cb53659240e1f30ba119.pdf","Oral History","Earth's Bounty in Iowa: Then and Now, Oral History Project",1,0
