 




﻿"Item Id","Item URI","Dublin Core:Title","Dublin Core:Subject","Dublin Core:Description","Dublin Core:Creator","Dublin Core:Source","Dublin Core:Publisher","Dublin Core:Date","Dublin Core:Contributor","Dublin Core:Rights","Dublin Core:Relation","Dublin Core:Format","Dublin Core:Language","Dublin Core:Type","Dublin Core:Identifier","Dublin Core:Coverage","Item Type Metadata:Text","Item Type Metadata:Interviewer","Item Type Metadata:Interviewee","Item Type Metadata:Location","Item Type Metadata:Transcription","Item Type Metadata:Local URL","Item Type Metadata:Original Format","Item Type Metadata:Physical Dimensions","Item Type Metadata:Duration","Item Type Metadata:Compression","Item Type Metadata:Producer","Item Type Metadata:Director","Item Type Metadata:Bit Rate/Frequency","Item Type Metadata:Time Summary","Item Type Metadata:Email Body","Item Type Metadata:Subject Line","Item Type Metadata:From","Item Type Metadata:To","Item Type Metadata:CC","Item Type Metadata:BCC","Item Type Metadata:Number of Attachments","Item Type Metadata:Standards","Item Type Metadata:Objectives","Item Type Metadata:Materials","Item Type Metadata:Lesson Plan Text","Item Type Metadata:URL","Item Type Metadata:Event Type","Item Type Metadata:Participants","Item Type Metadata:Birth Date","Item Type Metadata:Birthplace","Item Type Metadata:Death Date","Item Type Metadata:Occupation","Item Type Metadata:Biographical Text","Item Type Metadata:Bibliography","Item Type Metadata:Digital Reproduction Information","Item Type Metadata:Repository","Item Type Metadata:Repository Collection","Item Type Metadata:Contact information.","Item Type Metadata:File Name","Item Type Metadata:Notes","Item Type Metadata:Digital item created","Item Type Metadata:Digital item modified","Item Type Metadata:Executive Orders","Item Type Metadata:Record Created","Item Type Metadata:Record Modified","Item Type Metadata:Transcription2","Item Type Metadata:Source URL","Omeka Legacy File:Additional Creator","Omeka Legacy File:Transcriber","Omeka Legacy File:Producer","Omeka Legacy File:Render Device","Omeka Legacy File:Render Details","Omeka Legacy File:Capture Date","Omeka Legacy File:Capture Device","Omeka Legacy File:Capture Details","Omeka Legacy File:Change History","Omeka Legacy File:Watermark","Omeka Legacy File:Encryption","Omeka Legacy File:Compression","Omeka Legacy File:Post Processing","Omeka Image File:Width","Omeka Image File:Height","Omeka Image File:Bit Depth","Omeka Image File:Channels","Omeka Image File:Exif String","Omeka Image File:Exif Array","Omeka Image File:IPTC String","Omeka Image File:IPTC Array","Omeka Video File:Bitrate","Omeka Video File:Duration","Omeka Video File:Sample Rate","Omeka Video File:Codec","Omeka Video File:Width","Omeka Video File:Height",tags,file,itemType,collection,public,featured
68471,http://www.iowaheritage.org/items/show/68471,"Woman's Christian Temperance Union of Iowa proceedings, 1885-1890","Women's suffrage|Aldrich, Mary J.|Woman's Christian Temperance Union of Iowa|United States -- Iowa -- Iowa City|1880-1890|Women|Organizations|Temperance|Children|Mothers|Meetings|Travel|Foster, J. Ellen (Judith Ellen), 1840-|United States -- Iowa -- Des Moines|United States -- Iowa -- Sioux City|United States -- Iowa -- Cedar Rapids|United States -- Iowa -- Marshalltown","Organization dedicated to legislative and educational efforts to prevent juvenile delinquency and support woman's suffrage.",unidentified,,"Iowa Women's Archives",188-|2010-10-20,,"Educational use only, no other permissions given. U.S. and International copyright laws may protect this item. Commercial use or distribution of this digital object is not permitted without written permission of the Iowa Women's Archives.","Iowa Women's Suffrage|Woman's Christian Temperance Union of Iowa records|http://lib.uiowa.edu/collguides/?IWA0751|WCTU of Iowa Proceedings, 1884-1890",jpeg|21|14,,"Text|Proceedings; Speeches; Correspondence",IWA0751|index.cpd|http://digital.lib.uiowa.edu/cdm/ref/collection/suffrage/id/565,,,,,,,,,,,,,,,,,,,,,,,,,,,,,,,,,,,,,,,,,,,,,,,,"<a href=""http://digital.lib.uiowa.edu/cdm/ref/collection/suffrage/id/565"" target=""_blank"">View this item in its source respository</a>",,,,,,,,,,,,,,,,,,,,,,,,,,,,,http://www.iowaheritage.org/files/original/8b60af92923b940830b6b68f01403140.jpg,"Remote Item",,1,0
68469,http://www.iowaheritage.org/items/show/68469,"Woman's Christian Temperance Union of Iowa proceedings, 1874-1884","Women's suffrage|Aldrich, Mary J.|Woman's Christian Temperance Union of Iowa|United States -- Iowa -- Ottumwa|1870-1880|Women|Organizations|Temperance|Children|Mothers|Meetings|United States -- Iowa -- Burlington|United States -- Iowa -- Clinton|United States -- Iowa -- Muscatine|United States -- Iowa -- Oskaloosa|1880-1890","Organization dedicated to legislative and educational efforts to prevent juvenile delinquency and support woman's suffrage.",unidentified,,"Iowa Women's Archives",187-|2010-10-20,,"Educational use only, no other permissions given. U.S. and International copyright laws may protect this item. Commercial use or distribution of this digital object is not permitted without written permission of the Iowa Women's Archives.","Iowa Women's Suffrage|Woman's Christian Temperance Union of Iowa records|http://lib.uiowa.edu/collguides/?IWA0751|WCTU of Iowa Proceedings, 1874-1884",jpeg|21|14,,"Text|Proceedings; Speeches",IWA0751|index.cpd|http://digital.lib.uiowa.edu/cdm/ref/collection/suffrage/id/449,,,,,,,,,,,,,,,,,,,,,,,,,,,,,,,,,,,,,,,,,,,,,,,,"<a href=""http://digital.lib.uiowa.edu/cdm/ref/collection/suffrage/id/449"" target=""_blank"">View this item in its source respository</a>",,,,,,,,,,,,,,,,,,,,,,,,,,,,,http://www.iowaheritage.org/files/original/6e24839b3cb7f2c0f1ef7a24572ca8b8.jpg,"Remote Item",,1,0
68468,http://www.iowaheritage.org/items/show/68468,"Women in horse-drawn carriage, Iowa, 1900s","Women|Horses|Carriages & coaches|United States -- Iowa|1900-1910",,unknown,,"University of Iowa. Libraries. Iowa Women's Archives",1910/1919|2007-07-10,,"No known copyright restrictions.","Noble Photographs|Noble Photograph collection|http://www.lib.uiowa.edu/collguides/?IWA0031",9|14,,"Still image|Photographic postcards|jpeg",IWA0031|160192410|http://digital.lib.uiowa.edu/cdm/ref/collection/noble/id/1119,,,,,,,,,,,,,,,,,,,,,,,,,,,,,,,,,,,,,,,,,,,,,,,,"<a href=""http://digital.lib.uiowa.edu/cdm/ref/collection/noble/id/1119"" target=""_blank"">View this item in its source respository</a>",,,,,,,,,,,,,,,,,,,,,,,,,,,,,http://www.iowaheritage.org/files/original/b9c5d0fb8d9568fb202cdb047989d4d0.jpg,"Remote Item","Mary Noble Historical Photograph Collection",1,0
68467,http://www.iowaheritage.org/items/show/68467,"Woman's Christian Temperance Union annual convention programs, 1914-1920","Women's suffrage|Woman's Christian Temperance Union|United States -- Iowa -- Creston|1910-1920|United States -- Iowa -- Dubuque|United States -- Iowa|Organizations|Women|Temperance|Children|Political participation|Meetings",,unidentified,,"Iowa Women's Archives",191-|2010-10-20,,"Educational use only, no other permissions given. U.S. and International copyright laws may protect this item. Commercial use or distribution of this digital object is not permitted without written permission of the Iowa Women's Archives.","Iowa Women's Suffrage|Woman's Christian Temperance Union of Iowa records|http://lib.uiowa.edu/collguides/?IWA0751|Annual Conventions, Programs, 1911-1972, scattered",jpeg|20|14,,"Text; Still image|Programs (documents)",IWA0751|index.cpd|http://digital.lib.uiowa.edu/cdm/ref/collection/suffrage/id/401,,,,,,,,,,,,,,,,,,,,,,,,,,,,,,,,,,,,,,,,,,,,,,,,"<a href=""http://digital.lib.uiowa.edu/cdm/ref/collection/suffrage/id/401"" target=""_blank"">View this item in its source respository</a>",,,,,,,,,,,,,,,,,,,,,,,,,,,,,http://www.iowaheritage.org/files/original/761c43cb26c28db2012879a135b24493.jpg,"Remote Item",,1,0
68466,http://www.iowaheritage.org/items/show/68466,"Men and women posing outside with horses and Athens pennants at Lenox College, Hopkinton, Iowa, 1900s","Men|Women|Universities & colleges|Horses|Lenox College|United States -- Iowa -- Hopkinton|1900-1910",,unknown,,"University of Iowa. Libraries. Iowa Women's Archives",1910/1919|2007-07-10,,"No known copyright restrictions.","Noble Photographs|Noble Photograph collection|http://www.lib.uiowa.edu/collguides/?IWA0031",9|14,,"Still image; Text|Photographic postcards; Group portraits|jpeg",IWA0031|160192410|http://digital.lib.uiowa.edu/cdm/ref/collection/noble/id/1116,,,,,,,,,,,,,,,,,,,,,,,,,,,,,,,,,,,,,,,,,,,,,,,,"<a href=""http://digital.lib.uiowa.edu/cdm/ref/collection/noble/id/1116"" target=""_blank"">View this item in its source respository</a>",,,,,,,,,,,,,,,,,,,,,,,,,,,,,http://www.iowaheritage.org/files/original/204ced2d3d046a071e52f5a5ea25d7eb.jpg,"Remote Item","Mary Noble Historical Photograph Collection",1,0
68465,http://www.iowaheritage.org/items/show/68465,"Marion Federation of Women's Clubs minutes, 1913-1917","Women's suffrage|Marion Federation of Women's Clubs|United States -- Iowa -- Marion|1910-1920|Theatrical productions|Women|Organizations|Political participation|Politics & government","The Marion Federation of Women's Clubs was an umbrella organization that met monthly at the Marion Public Library, allowing individual women's clubs to work together on community service projects.",unidentified,,"Iowa Women's Archives",191-|2010-11-16,,"Educational use only, no other permissions given. U.S. and International copyright laws may protect this item. Commercial use or distribution of this digital object is not permitted without written permission of the Iowa Women's Archives.","Iowa Women's Suffrage|Marion Federation of Women's Clubs|http://www.lib.uiowa.edu/collguides/?IWA0643|Minutes 1913-1917",jpeg|24|19,,"Text|Clippings (information artifacts); Minutes",IWA0643|index.cpd|http://digital.lib.uiowa.edu/cdm/ref/collection/suffrage/id/376,,,,,,,,,,,,,,,,,,,,,,,,,,,,,,,,,,,,,,,,,,,,,,,,"<a href=""http://digital.lib.uiowa.edu/cdm/ref/collection/suffrage/id/376"" target=""_blank"">View this item in its source respository</a>",,,,,,,,,,,,,,,,,,,,,,,,,,,,,http://www.iowaheritage.org/files/original/9abd390e2edf994438e9035bbece4595.jpg,"Remote Item",,1,0
68464,http://www.iowaheritage.org/items/show/68464,"""Suppose you hurry and come home,"" September 1, 1906","Men|Women|Clocks & watches|Jacobs, Hattie|United States -- Iowa -- Madrid|1900-1910",,unknown,,"University of Iowa. Libraries. Iowa Women's Archives",1906-09-01|2007-07-10,,"Material in the public domain. No restrictions on use.","Noble Photographs|Noble Photograph collection|http://www.lib.uiowa.edu/collguides/?IWA0031",14|9,,"Still image; Text|Picture postcards; Correspondence|jpeg",IWA0031|160192410|http://digital.lib.uiowa.edu/cdm/ref/collection/noble/id/1113,,,,,,,,,,,,,,,,,,,,,,,,,,,,,,,,,,,,,,,,,,,,,,,,"<a href=""http://digital.lib.uiowa.edu/cdm/ref/collection/noble/id/1113"" target=""_blank"">View this item in its source respository</a>",,,,,,,,,,,,,,,,,,,,,,,,,,,,,http://www.iowaheritage.org/files/original/354f2b870b2b5eccfaae0aa05f73a73a.jpg,"Remote Item","Mary Noble Historical Photograph Collection",1,0
68463,http://www.iowaheritage.org/items/show/68463,"Iowa Federation of Women's Clubs biennial scrapbook, 1899-1909","Women's suffrage|Cory, Mary C.|Iowa Federation of Women's Clubs|United States -- Iowa|1890-1900|Women|Organizations|Politics & government|Political participation|1900-1910|United States -- Iowa -- Des Moines|Cummins, Albert Baird, 1850-1926","Nondenominational and nonpartisan organization bringing Iowa women's clubs together.",unidentified,,"Iowa Women's Archives",1899/1909|2010-10-20,,"Educational use only, no other permissions given. U.S. and International copyright laws may protect this item. Commercial use or distribution of this digital object is not permitted without written permission of the Iowa Women's Archives.","Iowa Women's Suffrage|Iowa Federation of Women's Clubs|http://www.lib.uiowa.edu/findingaids/IWATitleDetail.aspx?CollectionIdentifier=IWA0565|Biennial scrapbook, 1899-1909",jpeg|28|32,,"Text; Still image|Clippings (information artifacts); Scrapbooks",IWA0565|index.cpd|http://digital.lib.uiowa.edu/cdm/ref/collection/suffrage/id/357,,,,,,,,,,,,,,,,,,,,,,,,,,,,,,,,,,,,,,,,,,,,,,,,"<a href=""http://digital.lib.uiowa.edu/cdm/ref/collection/suffrage/id/357"" target=""_blank"">View this item in its source respository</a>",,,,,,,,,,,,,,,,,,,,,,,,,,,,,http://www.iowaheritage.org/files/original/3f89c358d17239dcab0c3cb21e0b19d7.jpg,"Remote Item",,1,0
68461,http://www.iowaheritage.org/items/show/68461,"Ellen Mowrer diary, 1865-1869","Families|United States -- Iowa|1860-1870|Farm life|Women|Young adults",,"Miller, Ellen Mowrer",,"Iowa Women's Archives",186-|2010-11-16,,"Educational use only, no other permissions given. U.S. and International copyright laws may protect this item. Commercial use or distribution of this digital object is not permitted without written permission of the Iowa Women's Archives.","Iowa Women's Suffrage|Ellen Mowrer Miller papers|http://lib.uiowa.edu/collguides/?IWA0298|Essay, 1865; Diary, 1868-1869",jpeg|20|17,,Text|Diaries,IWA0298|index.cpd|http://digital.lib.uiowa.edu/cdm/ref/collection/suffrage/id/348,,,,,,,,,,,,,,,,,,,,,,,,,,,,,,,,,,,,,,,,,,,,,,,,"<a href=""http://digital.lib.uiowa.edu/cdm/ref/collection/suffrage/id/348"" target=""_blank"">View this item in its source respository</a>",,,,,,,,,,,,,,,,,,,,,,,,,,,,,http://www.iowaheritage.org/files/original/dffe45d3219ce9a938b50a17e9d280a3.jpg,"Remote Item",,1,0
68460,http://www.iowaheritage.org/items/show/68460,"""I want to get next to you,"" Jun. 30, 1910","Men|Women|Theaters|Jacobs, Hattie|United States -- Illinois -- Chicago|United States -- Iowa -- Des Moines|1910-1920",,unknown,,"E.L. Theochrom|University of Iowa. Libraries. Iowa Women's Archives",1910-06-30|2007-07-10,,"Material in the public domain. No restrictions on use.","Noble Photographs|Noble Photograph collection|http://www.lib.uiowa.edu/collguides/?IWA0031",14|9,,"Still image; Text|Picture postcards; Correspondence|jpeg",IWA0031|160192410|http://digital.lib.uiowa.edu/cdm/ref/collection/noble/id/1107,,,,,,,,,,,,,,,,,,,,,,,,,,,,,,,,,,,,,,,,,,,,,,,,"<a href=""http://digital.lib.uiowa.edu/cdm/ref/collection/noble/id/1107"" target=""_blank"">View this item in its source respository</a>",,,,,,,,,,,,,,,,,,,,,,,,,,,,,http://www.iowaheritage.org/files/original/03749adb507a106130997b2de441e47f.jpg,"Remote Item","Mary Noble Historical Photograph Collection",1,0
