 




﻿"Item Id","Item URI","Dublin Core:Title","Dublin Core:Subject","Dublin Core:Description","Dublin Core:Creator","Dublin Core:Source","Dublin Core:Publisher","Dublin Core:Date","Dublin Core:Contributor","Dublin Core:Rights","Dublin Core:Relation","Dublin Core:Format","Dublin Core:Language","Dublin Core:Type","Dublin Core:Identifier","Dublin Core:Coverage","Item Type Metadata:Text","Item Type Metadata:Interviewer","Item Type Metadata:Interviewee","Item Type Metadata:Location","Item Type Metadata:Transcription","Item Type Metadata:Local URL","Item Type Metadata:Original Format","Item Type Metadata:Physical Dimensions","Item Type Metadata:Duration","Item Type Metadata:Compression","Item Type Metadata:Producer","Item Type Metadata:Director","Item Type Metadata:Bit Rate/Frequency","Item Type Metadata:Time Summary","Item Type Metadata:Email Body","Item Type Metadata:Subject Line","Item Type Metadata:From","Item Type Metadata:To","Item Type Metadata:CC","Item Type Metadata:BCC","Item Type Metadata:Number of Attachments","Item Type Metadata:Standards","Item Type Metadata:Objectives","Item Type Metadata:Materials","Item Type Metadata:Lesson Plan Text","Item Type Metadata:URL","Item Type Metadata:Event Type","Item Type Metadata:Participants","Item Type Metadata:Birth Date","Item Type Metadata:Birthplace","Item Type Metadata:Death Date","Item Type Metadata:Occupation","Item Type Metadata:Biographical Text","Item Type Metadata:Bibliography","Item Type Metadata:Digital Reproduction Information","Item Type Metadata:Repository","Item Type Metadata:Repository Collection","Item Type Metadata:Contact information.","Item Type Metadata:File Name","Item Type Metadata:Notes","Item Type Metadata:Digital item created","Item Type Metadata:Digital item modified","Item Type Metadata:Executive Orders","Item Type Metadata:Record Created","Item Type Metadata:Record Modified","Item Type Metadata:Transcription2","Item Type Metadata:Source URL","Omeka Legacy File:Additional Creator","Omeka Legacy File:Transcriber","Omeka Legacy File:Producer","Omeka Legacy File:Render Device","Omeka Legacy File:Render Details","Omeka Legacy File:Capture Date","Omeka Legacy File:Capture Device","Omeka Legacy File:Capture Details","Omeka Legacy File:Change History","Omeka Legacy File:Watermark","Omeka Legacy File:Encryption","Omeka Legacy File:Compression","Omeka Legacy File:Post Processing","Omeka Image File:Width","Omeka Image File:Height","Omeka Image File:Bit Depth","Omeka Image File:Channels","Omeka Image File:Exif String","Omeka Image File:Exif Array","Omeka Image File:IPTC String","Omeka Image File:IPTC Array","Omeka Video File:Bitrate","Omeka Video File:Duration","Omeka Video File:Sample Rate","Omeka Video File:Codec","Omeka Video File:Width","Omeka Video File:Height",tags,file,itemType,collection,public,featured
41516,http://www.iowaheritage.org/items/show/41516,"Standard Atlas of Clayton County, Iowa","United States|Iowa|Clayton County|1900-1910||||","(Geo. A. Ogle & Co., 1902, Standard Atlas of Clayton County, Iowa)",,,"Geo. A. Ogle & Co.;|State Historical Society of Iowa (Iowa City);",1902|2011-08-19,,"No commercial reproduction or distribution of this file is permitted without permission.","Iowa Counties Historic Atlases;","1 atlas: b&w.; 39 X 45 cm.",English,"Text; Still image;|Maps; Plats (Maps); Title pages; Tables of contents; World maps; Land surveys; Histories; Directories;|jp2;",168474626|https://digital.lib.uiowa.edu/,,,,,,,,,,,,,,,,,,,,,,,,,,,,,,,,,,,,,,,,,,,,,,,,"<a href=""https://digital.lib.uiowa.edu/"" target=""_blank"">View this item in its source respository</a>",,,,,,,,,,,,,,,,,,,,,,,,,,,,,http://www.iowaheritage.org/files/original/9eefae2bad2e4c857a9b3ab9fdad39b6.jpg,"Remote Item","Iowa Counties Historic Atlases",1,0
41639,http://www.iowaheritage.org/items/show/41639,"Standard Atlas of Clayton County, Iowa","Clayton County",,,,,1902,,,,,,,https://digital.lib.uiowa.edu/,,,,,,,,,,,,,,,,,,,,,,,,,,,,,,,,,,,,,,,,,,,,,,,,"<a href=""https://digital.lib.uiowa.edu/"" target=""_blank"">View this item in its source respository</a>",,,,,,,,,,,,,,,,,,,,,,,,,,,,,http://www.iowaheritage.org/files/original/12248ccad149a9b7601c295619b4e4c5.jpg,"Remote Item","Iowa Counties Historic Atlases",1,0
41266,http://www.iowaheritage.org/items/show/41266,"Standard Atlas of Crawford County, Iowa","United States|Iowa|Crawford County|1900-1910",,,,"Geo. A. Ogle & Co.|State Historical Society of Iowa (Iowa City)",1908|2008-12-19,,"No commercial reproduction or distribution of this file is permitted without permission.","Iowa Counties Historic Atlases","1 atlas ; 46 cm.",English,"Still image; Text|Atlases; Title pages|jp2",168474626|https://digital.lib.uiowa.edu/,,,,,,,,,,,,,,,,,,,,,,,,,,,,,,,,,,,,,,,,,,,,,,,,"<a href=""https://digital.lib.uiowa.edu/"" target=""_blank"">View this item in its source respository</a>",,,,,,,,,,,,,,,,,,,,,,,,,,,,,http://www.iowaheritage.org/files/original/84053ffb8b022b4719b959e9b7a60e8f.jpg,"Remote Item","Iowa Counties Historic Atlases",1,0
41144,http://www.iowaheritage.org/items/show/41144,"Standard atlas of Dickinson County, Iowa","United States|Iowa|Dickinson County|1910-1920",,,,"Geo. A. Ogle & Co.|State Historical Society of Iowa (Iowa City)",1911,,"No commercial reproduction or distribution of this file is permitted without permission.","Iowa Counties Historic Atlases",,English,"Still image; Text|Atlases|jp2",168474626|https://digital.lib.uiowa.edu/,,,,,,,,,,,,,,,,,,,,,,,,,,,,,,,,,,,,,,,,,,,,,,,,"<a href=""https://digital.lib.uiowa.edu/"" target=""_blank"">View this item in its source respository</a>",,,,,,,,,,,,,,,,,,,,,,,,,,,,,http://www.iowaheritage.org/files/original/abba0885a37addcbaca39d7f6d81a173.jpg,"Remote Item","Iowa Counties Historic Atlases",1,0
41050,http://www.iowaheritage.org/items/show/41050,"Standard atlas of Emmet County, Iowa","United States|Iowa|Emmet County|1910-1920",,,,"Geo. A. Ogle & Co.|University of Iowa. Libraries. Map Collection",1918|2005-06-20,,"No commercial reproduction or distribution of this file is permitted without permission.","Iowa Counties Historic Atlases","1 atlas : 51 p. ; 45 cm.",English,"Text; Still Image|jp2",168474626|https://digital.lib.uiowa.edu/,,,,,,,,,,,,,,,,,,,,,,,,,,,,,,,,,,,,,,,,,,,,,,,,"<a href=""https://digital.lib.uiowa.edu/"" target=""_blank"">View this item in its source respository</a>",,,,,,,,,,,,,,,,,,,,,,,,,,,,,http://www.iowaheritage.org/files/original/f5f4973ed60729a8dff4ba8e0a766907.jpg,"Remote Item","Iowa Counties Historic Atlases",1,0
41104,http://www.iowaheritage.org/items/show/41104,"Standard atlas of Floyd County, Iowa","United States|Iowa|Floyd County|1910-1920",,,,"Anderson Publishing Co.|State Historical Society of Iowa (Iowa City)",1913|2006-05-11,,"No commercial reproduction or distribution of this file is permitted without permission.","Iowa Counties Historic Atlases|Atlas of Floyd County, Iowa (Chicago, IL: Anderson Publishing Co., 1913)","1 atlas : 29 p. ; 42 cm",English,"Text; Still Image|Atlases; Directories; Maps|jp2",168474626|https://digital.lib.uiowa.edu/,,,,,,,,,,,,,,,,,,,,,,,,,,,,,,,,,,,,,,,,,,,,,,,,"<a href=""https://digital.lib.uiowa.edu/"" target=""_blank"">View this item in its source respository</a>",,,,,,,,,,,,,,,,,,,,,,,,,,,,,http://www.iowaheritage.org/files/original/c399aad6c25f36dc233ddda7361b9003.jpg,"Remote Item","Iowa Counties Historic Atlases",1,0
41315,http://www.iowaheritage.org/items/show/41315,"Standard Atlas of Greene County, Iowa","United States|Iowa|Greene|1910-1920|","Geo. A. Ogle & Co., 1917, Standard Atlas of Greene County, Iowa.",,,"Geo. A. Ogle & Co.;|University of Iowa. Libraries. Map Collection",1917|2010-07-30,,"No commercial reproduction or distribution of this file is permitted without permission.","Iowa Counties Historic Atlases|Standard Atlas of Greene County, Iowa (Chicago, IL:  Geo. A. Ogle & Co., 1917)","1 atlas: b&w.; 39 x 45 cm.",English,"Still image; Text;|Atlases; Articles; Advertisements; Maps; Plats (Maps);|jp2;","ogle 1917 (Greene )|168474626|https://digital.lib.uiowa.edu/",,,,,,,,,,,,,,,,,,,,,,,,,,,,,,,,,,,,,,,,,,,,,,,,"<a href=""https://digital.lib.uiowa.edu/"" target=""_blank"">View this item in its source respository</a>",,,,,,,,,,,,,,,,,,,,,,,,,,,,,http://www.iowaheritage.org/files/original/e2d8436990c905028349fc8e8a487ab4.jpg,"Remote Item","Iowa Counties Historic Atlases",1,0
41056,http://www.iowaheritage.org/items/show/41056,"Standard Atlas of Henry County, Iowa","United States|Iowa|Henry County|1910-1920","Geo. A. Ogle & Co.'s 1917 Standard atlas of Henry County, Iowa.",,,"Geo. A. Ogle & Co.|University of Iowa. Libraries. Map Collection",1917|2005-06-29,,"No commercial reproduction or distribution of this file is permitted without permission.","Iowa Counties Historic Atlases","1 atlas : 57 p ; 46 cm.",English,"Still image|Atlases|jp2",168474626|https://digital.lib.uiowa.edu/,,,,,,,,,,,,,,,,,,,,,,,,,,,,,,,,,,,,,,,,,,,,,,,,"<a href=""https://digital.lib.uiowa.edu/"" target=""_blank"">View this item in its source respository</a>",,,,,,,,,,,,,,,,,,,,,,,,,,,,,http://www.iowaheritage.org/files/original/967e038430f7c9c58a76af5ec9106692.jpg,"Remote Item","Iowa Counties Historic Atlases",1,0
41272,http://www.iowaheritage.org/items/show/41272,"Standard Atlas of Iowa County, Iowa","United States|Iowa|Iowa County|1910-1920","Anderson Publishing Co.'s 1917 Standard Atlas of Iowa County, Iowa.",,,"Anderson Publishing Co.|University of Iowa. Libraries. Map Collection",1917|2009-11-03,,"No commercial reproduction or distribution of this file is permitted without permission.","Iowa Counties Historic Atlases","1 atlas: b&w.: 38 X 45 cm",English,"Still image; Text|Atlases; Plats (Maps); Maps; Articles; Gazetteer|jp2",168474626|https://digital.lib.uiowa.edu/,,,,,,,,,,,,,,,,,,,,,,,,,,,,,,,,,,,,,,,,,,,,,,,,"<a href=""https://digital.lib.uiowa.edu/"" target=""_blank"">View this item in its source respository</a>",,,,,,,,,,,,,,,,,,,,,,,,,,,,,http://www.iowaheritage.org/files/original/2460ca7855fa1541033ca778a8820fc9.jpg,"Remote Item","Iowa Counties Historic Atlases",1,0
41313,http://www.iowaheritage.org/items/show/41313,"Standard Atlas of Jefferson County, Iowa","United States|Iowa|Jefferson County|1900-1910||||","Geo. A. Olge & Co.'s 1909 Atlas of Jefferson County, Iowa",,,"Geo. A. Ogle & Co.;|University of Iowa. Libraries. Map Collection;",1909|2010-07-09,,"No commercial reproduction or distribution of this file is permitted without permission.","Iowa Counties Historic Atlases;","1 atlas: b&w; 45 X 38 cm.",English,"Still image; Still image;|Atlases; Plat books; Maps; Articles;|jp2;",168474626|https://digital.lib.uiowa.edu/,,,,,,,,,,,,,,,,,,,,,,,,,,,,,,,,,,,,,,,,,,,,,,,,"<a href=""https://digital.lib.uiowa.edu/"" target=""_blank"">View this item in its source respository</a>",,,,,,,,,,,,,,,,,,,,,,,,,,,,,http://www.iowaheritage.org/files/original/a77705e40d98a8b41a83636a4703187e.jpg,"Remote Item","Iowa Counties Historic Atlases",1,0
