 




﻿"Item Id","Item URI","Dublin Core:Title","Dublin Core:Subject","Dublin Core:Description","Dublin Core:Creator","Dublin Core:Source","Dublin Core:Publisher","Dublin Core:Date","Dublin Core:Contributor","Dublin Core:Rights","Dublin Core:Relation","Dublin Core:Format","Dublin Core:Language","Dublin Core:Type","Dublin Core:Identifier","Dublin Core:Coverage","Item Type Metadata:Text","Item Type Metadata:Interviewer","Item Type Metadata:Interviewee","Item Type Metadata:Location","Item Type Metadata:Transcription","Item Type Metadata:Local URL","Item Type Metadata:Original Format","Item Type Metadata:Physical Dimensions","Item Type Metadata:Duration","Item Type Metadata:Compression","Item Type Metadata:Producer","Item Type Metadata:Director","Item Type Metadata:Bit Rate/Frequency","Item Type Metadata:Time Summary","Item Type Metadata:Email Body","Item Type Metadata:Subject Line","Item Type Metadata:From","Item Type Metadata:To","Item Type Metadata:CC","Item Type Metadata:BCC","Item Type Metadata:Number of Attachments","Item Type Metadata:Standards","Item Type Metadata:Objectives","Item Type Metadata:Materials","Item Type Metadata:Lesson Plan Text","Item Type Metadata:URL","Item Type Metadata:Event Type","Item Type Metadata:Participants","Item Type Metadata:Birth Date","Item Type Metadata:Birthplace","Item Type Metadata:Death Date","Item Type Metadata:Occupation","Item Type Metadata:Biographical Text","Item Type Metadata:Bibliography","Item Type Metadata:Digital Reproduction Information","Item Type Metadata:Repository","Item Type Metadata:Repository Collection","Item Type Metadata:Contact information.","Item Type Metadata:File Name","Item Type Metadata:Notes","Item Type Metadata:Digital item created","Item Type Metadata:Digital item modified","Item Type Metadata:Executive Orders","Item Type Metadata:Record Created","Item Type Metadata:Record Modified","Item Type Metadata:Transcription2","Item Type Metadata:Source URL","Omeka Legacy File:Additional Creator","Omeka Legacy File:Transcriber","Omeka Legacy File:Producer","Omeka Legacy File:Render Device","Omeka Legacy File:Render Details","Omeka Legacy File:Capture Date","Omeka Legacy File:Capture Device","Omeka Legacy File:Capture Details","Omeka Legacy File:Change History","Omeka Legacy File:Watermark","Omeka Legacy File:Encryption","Omeka Legacy File:Compression","Omeka Legacy File:Post Processing","Omeka Image File:Width","Omeka Image File:Height","Omeka Image File:Bit Depth","Omeka Image File:Channels","Omeka Image File:Exif String","Omeka Image File:Exif Array","Omeka Image File:IPTC String","Omeka Image File:IPTC Array","Omeka Video File:Bitrate","Omeka Video File:Duration","Omeka Video File:Sample Rate","Omeka Video File:Codec","Omeka Video File:Width","Omeka Video File:Height",tags,file,itemType,collection,public,featured
17247,http://www.iowaheritage.org/items/show/17247,"Henry A. Wallace correspondence [reel 8], June 22, 1931-Aug. 20, 1931","Federal land banks|Vice presidents|Wallace, Henry Agard, 1888-1965|1930-1940|Wallaces' Farmer|Monetary policy|Speaking invitations|Politics & government",,"Wallace, Henry Agard, 1888-1965; Black, Albert G.; Black, John D. (John Donald), 1883-1960; Bowman, Oliver S., 1865-1942; Burtness, Olger B. (Olger Burton), 1884-1960; Duddy, Edward A. (Edward Augustin), 1884-; Gregory, Clifford Verne, 1883-; Hoit, Lowell; McKee, Daniel; Pinchot, Gifford, 1865-1946; Tinnes, Dana J.",,"University of Iowa. Libraries. Special Collections Dept.",1931-06-22|2009,,"Educational use only, no other permissions given. U.S. and international copyright laws may protect this item. Commercial use or distribution of this digital object is not permitted without written permission of the University of Iowa Special Collections Dept.","Henry A. Wallace Collection|Henry A. Wallace Correspondence|Henry Agard Wallace papers|http://lib.uiowa.edu/collguides/?MSC0177|Microfilm digitized by Heritage Microfilm, Cedar Rapids, IA at 400 ppi, 8-bit grayscale.  Display images in JPEG format derived from master TIFFs.",jpeg,,Text|Correspondence,08|MSC0177|https://digital.lib.uiowa.edu/,,,,,,,,,,,,,,,,,,,,,,,,,,,,,,,,,,,,,,,,,,,,,,,,"<a href=""https://digital.lib.uiowa.edu/"" target=""_blank"">View this item in its source respository</a>",,,,,,,,,,,,,,,,,,,,,,,,,,,,,http://www.iowaheritage.org/files/original/c01502d9f6ac7a3e8542e87cbdd761ae.jpg,"Remote Item","Henry A. Wallace Collection",1,0
17245,http://www.iowaheritage.org/items/show/17245,"Henry A. Wallace correspondence [reel 9], Aug. 21, 1931-Oct. 5, 1931","Corn prices|Vice presidents|Wallace, Henry Agard, 1888-1965|1930-1940|Wallaces' Farmer|Monetary conferences and policy|Tax reform|Speaking invitations|Politics & government",,"Wallace, Henry Agard, 1888-1965; Black, Albert G.; Crowther, Samuel; Davis, Chester C. (Chester Charles), b. 1887; Duddy, Edward A. (Edward Augustin), 1884-; Funk, E. D.; Gregory, Clifford Verne, 1883-; Hughes, Harold De Mott, 1882-1969; Lowden, Frank O. (Frank Orren), 1861-1943; Roos, Charles; Roos, Juanita; Russell, George William, 1867-1935; Snyder, Carl, 1869-1946; Snyder, Ralph",,"University of Iowa. Libraries. Special Collections Dept.",1931-08-21|2009,,"Educational use only, no other permissions given. U.S. and international copyright laws may protect this item. Commercial use or distribution of this digital object is not permitted without written permission of the University of Iowa Special Collections Dept.","Henry A. Wallace Collection|Henry A. Wallace Correspondence|Henry Agard Wallace papers|http://lib.uiowa.edu/collguides/?MSC0177|Microfilm digitized by Heritage Microfilm, Cedar Rapids, IA at 400 ppi, 8-bit grayscale.  Display images in JPEG format derived from master TIFFs.",jpeg,,Text|Correspondence,09|MSC0177|https://digital.lib.uiowa.edu/,,,,,,,,,,,,,,,,,,,,,,,,,,,,,,,,,,,,,,,,,,,,,,,,"<a href=""https://digital.lib.uiowa.edu/"" target=""_blank"">View this item in its source respository</a>",,,,,,,,,,,,,,,,,,,,,,,,,,,,,http://www.iowaheritage.org/files/original/b268d45c82f9d6a3c3a05c5e62cdd9da.jpg,"Remote Item","Henry A. Wallace Collection",1,0
20482,http://www.iowaheritage.org/items/show/20482,"Henry A. Wallace digital collection poster",,,,,,,,,,,,,411-1-Wallace_Poster_K12.pdf|https://digital.lib.uiowa.edu/,,,,,,,,,,,,,,,,,,,,,,,,,,,,,,,,,,,,,,,,,,,,,,,,"<a href=""https://digital.lib.uiowa.edu/"" target=""_blank"">View this item in its source respository</a>",,,,,,,,,,,,,,,,,,,,,,,,,,,,,http://www.iowaheritage.org/files/original/d4b1bb7ba5a9e9a6f6036e9e12974c18.jpg,"Remote Item","Henry A. Wallace Collection",1,0
17592,http://www.iowaheritage.org/items/show/17592,"Henry A. Wallace dining during official trip, Panama, Apr.  1943","Vice presidents|Wallace, Henry A. (Henry Agard), 1888-1965|Panama|1940-1950|Eating & drinking|Government officials",,unidentified,,"University of Iowa. Libraries. Special Collections Dept.",1943-04|2010-02-01,,"Educational use only, no other permissions given. U.S. and international copyright laws may protect this item. Commercial use or distribution of this digital object is not permitted without written permission of the University of Iowa Special Collections Dept.","Henry A. Wallace Collection|Henry Agard Wallace papers|http://lib.uiowa.edu/collguides/?MSC0177|Photographs & images|Miscellaneous|Scanned with Ricoh 3228C scanner at 300 ppi. Archival tiff available.",jpeg,,"Still image|Photographs",MSC0177|7|8|wal-052.jpg|https://digital.lib.uiowa.edu/,,,,,,,,,,,,,,,,,,,,,,,,,,,,,,,,,,,,,,,,,,,,,,,,"<a href=""https://digital.lib.uiowa.edu/"" target=""_blank"">View this item in its source respository</a>",,,,,,,,,,,,,,,,,,,,,,,,,,,,,http://www.iowaheritage.org/files/original/36220f26ebe2ef8034300bb90b42fc43.jpg,"Remote Item","Henry A. Wallace Collection",1,0
17543,http://www.iowaheritage.org/items/show/17543,"Henry A. Wallace giving speech, New York City, Sept. 11, 1947","Statesmen|Wallace, Henry A. (Henry Agard), 1888-1965|United States -- New York -- New York|1940-1950|Microphones|Public speaking",,unidentified,,"University of Iowa. Libraries. Special Collections Dept.",1947-09-11|2010-02-01,,"Educational use only, no other permissions given. U.S. and international copyright laws may protect this item. Commercial use or distribution of this digital object is not permitted without written permission of the University of Iowa Special Collections Dept.","Henry A. Wallace Collection|Henry Agard Wallace papers|http://lib.uiowa.edu/collguides/?MSC0177|Photographs & images|The Richards Collection of Henry A. Wallace|Scanned with Ricoh 3228C scanner at 300 ppi. Archival tiff available.",jpeg,,"Still image|Photographs",MSC0177|7|17|wal-024.jpg|https://digital.lib.uiowa.edu/,,,,,,,,,,,,,,,,,,,,,,,,,,,,,,,,,,,,,,,,,,,,,,,,"<a href=""https://digital.lib.uiowa.edu/"" target=""_blank"">View this item in its source respository</a>",,,,,,,,,,,,,,,,,,,,,,,,,,,,,http://www.iowaheritage.org/files/original/fba19f300aa211458700d2593801cc23.jpg,"Remote Item","Henry A. Wallace Collection",1,0
17545,http://www.iowaheritage.org/items/show/17545,"Henry A. Wallace giving speech, Sibley, Iowa, 1940s","Crowds|Wallace, Henry A. (Henry Agard), 1888-1965|United States -- Iowa -- Sibley|1940-1950|Public speaking|Statesmen",,unidentified,,"University of Iowa. Libraries. Special Collections Dept.",1940/1949|2010-02-01,,"Educational use only, no other permissions given. U.S. and international copyright laws may protect this item. Commercial use or distribution of this digital object is not permitted without written permission of the University of Iowa Special Collections Dept.","Henry A. Wallace Collection|Henry Agard Wallace papers|http://lib.uiowa.edu/collguides/?MSC0177|Photographs & images|Scanned with Ricoh 3228C scanner at 300 ppi. Archival tiff available.",jpeg,,"Still image|Photographs",MSC0177|7|23|wal-020.jpg|https://digital.lib.uiowa.edu/,,,,,,,,,,,,,,,,,,,,,,,,,,,,,,,,,,,,,,,,,,,,,,,,"<a href=""https://digital.lib.uiowa.edu/"" target=""_blank"">View this item in its source respository</a>",,,,,,,,,,,,,,,,,,,,,,,,,,,,,http://www.iowaheritage.org/files/original/685f9fee2d795b69568d4e4a5e20a80a.jpg,"Remote Item","Henry A. Wallace Collection",1,0
20467,http://www.iowaheritage.org/items/show/20467,"Henry A. Wallace in front of silo, United States, 1930s","Statesmen|Wallace, Henry A. (Henry Agard), 1888-1965|United States|1930-1940|Silos",,unidentified,,"University of Iowa. Libraries. Special Collections Dept.",1930/1939|2010-02-01,,"Educational use only, no other permissions given. U.S. and international copyright laws may protect this item. Commercial use or distribution of this digital object is not permitted without written permission of the University of Iowa Special Collections Dept.","Henry A. Wallace Collection|Henry Agard Wallace papers|http://lib.uiowa.edu/collguides/?MSC0177|Photographs & images|Miscellaneous|Scanned with Ricoh 3228C scanner at 300 ppi. Archival tiff available.",jpeg,,"Still image|Photographs",MSC0177|7|29|wal-041.jpg|https://digital.lib.uiowa.edu/,,,,,,,,,,,,,,,,,,,,,,,,,,,,,,,,,,,,,,,,,,,,,,,,"<a href=""https://digital.lib.uiowa.edu/"" target=""_blank"">View this item in its source respository</a>",,,,,,,,,,,,,,,,,,,,,,,,,,,,,http://www.iowaheritage.org/files/original/29b31dfc54735f6220994a3db7706162.jpg,"Remote Item","Henry A. Wallace Collection",1,1
17555,http://www.iowaheritage.org/items/show/17555,"Henry A. Wallace in receiving line for President Truman on White House front lawn, Washington, D.C., between 1945 and 1947","Cabinet officers|Wallace, Henry A. (Henry Agard), 1888-1965|White House (Washington, D.C.)|United States -- Washington, D.C.|1940-1950|Presidents|Receiving lines|Truman, Harry S., 1884-1972",,unidentified,,"University of Iowa. Libraries. Special Collections Dept.",1940/1949|2010-02-01,,"Educational use only, no other permissions given. U.S. and international copyright laws may protect this item. Commercial use or distribution of this digital object is not permitted without written permission of the University of Iowa Special Collections Dept.","Henry A. Wallace Collection|Henry Agard Wallace papers|http://lib.uiowa.edu/collguides/?MSC0177|Photographs & images|Henry A. Wallace (Various Poses) - 8"" x 10""|Scanned with Ricoh 3228C scanner at 300 ppi. Archival tiff available.",jpeg,,"Still image|Photographs",MSC0177|7|9|wal-015.jpg|https://digital.lib.uiowa.edu/,,,,,,,,,,,,,,,,,,,,,,,,,,,,,,,,,,,,,,,,,,,,,,,,"<a href=""https://digital.lib.uiowa.edu/"" target=""_blank"">View this item in its source respository</a>",,,,,,,,,,,,,,,,,,,,,,,,,,,,,http://www.iowaheritage.org/files/original/98b685dd8cd47d93c5e4b529333e4200.jpg,"Remote Item","Henry A. Wallace Collection",1,0
16571,http://www.iowaheritage.org/items/show/16571,"Henry A. Wallace playing cricket, China, 1944","Men|Wallace, Henry A. (Henry Agard), 1888-1965|China|1940-1950|Vice presidents|Politicians|Cricket",,unidentified,,"University of Iowa. Libraries. Special Collections Dept.",1944|2009-02-20,,"Educational use only, no other permissions given. U.S. and international copyright laws may protect this item. Commercial use or distribution of this digital object is not permitted without written permission of the University of Iowa Special Collections Dept.","Henry A. Wallace Collection|Henry Agard Wallace papers|http://lib.uiowa.edu/collguides/?MSC0177|7|China-Siberia Trip, 1944|Scanned with Ricoh 3228C scanner at 600 ppi. Archival tiff available.",jpeg|7|5,,"Still image|Photographs","MSC0177|Print 155|wal73-155.jpg|https://digital.lib.uiowa.edu/",,,,,,,,,,,,,,,,,,,,,,,,,,,,,,,,,,,,,,,,,,,,,,,,"<a href=""https://digital.lib.uiowa.edu/"" target=""_blank"">View this item in its source respository</a>",,,,,,,,,,,,,,,,,,,,,,,,,,,,,http://www.iowaheritage.org/files/original/6454d93cf97628402aea3d73cfead181.jpg,"Remote Item","Henry A. Wallace Collection",1,0
17604,http://www.iowaheritage.org/items/show/17604,"Henry A. Wallace posing with group of African Americans, United States, 1940s","Statesmen|African Americans|Wallace, Henry A. (Henry Agard), 1888-1965|United States|1940-1950",,unidentified,,"University of Iowa. Libraries. Special Collections Dept.",1940/1949|2010-02-01,,"Educational use only, no other permissions given. U.S. and international copyright laws may protect this item. Commercial use or distribution of this digital object is not permitted without written permission of the University of Iowa Special Collections Dept.","Henry A. Wallace Collection|Henry Agard Wallace papers|http://lib.uiowa.edu/collguides/?MSC0177|Photographs & images|Miscellaneous|Scanned with Ricoh 3228C scanner at 300 ppi. Archival tiff available.",jpeg,,"Still image|Photographs; Group portraits",MSC0177|7|2|wal-045.jpg|https://digital.lib.uiowa.edu/,,,,,,,,,,,,,,,,,,,,,,,,,,,,,,,,,,,,,,,,,,,,,,,,"<a href=""https://digital.lib.uiowa.edu/"" target=""_blank"">View this item in its source respository</a>",,,,,,,,,,,,,,,,,,,,,,,,,,,,,,"Remote Item","Henry A. Wallace Collection",1,0
